program: Orca
programVersion: 5.0.2
elementType: O O O C C C C C C C C C C C C C C C C C C C C C C C H H H H H H H H H H H H H H H H H H H H H H H H H H
charge: 0
multiplicity: 1
keywords: wb97x-d3
keywords: def2-TZVPP
keywords: def2/J RIJCOSX
keywords: DEFGRID2
keywords: scfconv7
keywords: smallprint printgap noloewdin
keywords: NOSOSCF
formula: C23H26O3
InChI: InChI=1/C23H26O3/c1-16(2)13-20-21(23(20,3)4)22(24)25-15-17-9-8-12-19(14-17)26-18-10-6-5-7-11-18/h5-14,20-21H,15H2,1-4H3
52 atoms
O  -1.911082 1.034854 1.349904
O  -0.912934 -0.446038 2.694947
O  3.202393 0.943086 -0.140288
C  -3.572333 -1.18727 0.158146
C  -2.257215 -1.373687 -0.532644
C  -2.319262 -1.269676 1.002333
C  -4.45642 -2.410298 0.254401
C  -4.373877 0.081357 -0.00533
C  -1.630319 -0.337908 -1.373322
C  -1.649416 -0.199011 1.76261
C  -0.850151 -0.551469 -2.44008
C  -0.269243 0.608636 -3.19166
C  -0.451437 -1.891562 -2.976079
C  -1.130569 2.140629 1.836849
C  -0.009688 2.404773 0.873124
C  1.106055 1.574027 0.87034
C  -0.110053 3.424988 -0.066688
C  2.086198 1.738404 -0.097105
C  0.898685 3.607556 -1.002792
C  1.99268 2.756972 -1.035732
C  3.091657 -0.40004 0.127588
C  4.153762 -1.000666 0.787957
C  1.996948 -1.151273 -0.283078
C  4.11589 -2.365226 1.040541
C  1.9667 -2.511326 -0.011582
C  3.021426 -3.125347 0.651128
H  -2.0575 -2.391742 -0.847417
H  -2.175862 -2.221554 1.500497
H  -5.140033 -2.332141 1.102018
H  -3.875949 -3.325076 0.378476
H  -5.05875 -2.518288 -0.64935
H  -5.081629 -0.051175 -0.825723
H  -3.785312 0.964923 -0.229619
H  -4.9557 0.287188 0.894772
H  -1.826296 0.695554 -1.115851
H  -0.590288 0.601762 -4.236386
H  0.822931 0.555198 -3.204945
H  -0.553501 1.56577 -2.755603
H  -0.908428 -2.733444 -2.461505
H  0.632534 -2.017179 -2.920732
H  -0.713301 -1.969736 -4.033468
H  -0.767299 1.950119 2.846039
H  -1.816681 2.984661 1.87463
H  1.20285 0.795916 1.616774
H  -0.976471 4.074348 -0.068189
H  0.822553 4.404469 -1.730644
H  2.768202 2.881272 -1.780669
H  5.003018 -0.405551 1.099422
H  1.167275 -0.689866 -0.804229
H  4.945507 -2.831274 1.555683
H  1.108963 -3.091537 -0.327929
H  2.99095 -4.186332 0.859798
elementType: O C H
totalener: -1117.84998143 hartree
nucrepener: 2412.81271505 hartree
electener: -3530.66269648 hartree
oneelecener: -6315.26298811 hartree
twoeener: 2784.60029163 hartree
cpcmener: -0.03034850 hartree
kineticenergy: 1112.80552349 hartree
xcener: -110.233879857735 hartree
chargesum: -0.0000000
charge: -0.268503 -0.502177 -0.341308 0.112872 0.015401 -0.107788 -0.268888 -0.271279 -0.292070 0.412446 0.002644 -0.273727 -0.274552 0.054036 -0.014301 -0.174326 -0.209383 0.292997 -0.122906 -0.261103 0.238653 -0.208700 -0.095955 -0.151389 -0.208804 -0.163729 0.118165 0.097298 0.094920 0.088571 0.095244 0.095037 0.090553 0.103142 0.124128 0.113760 0.094693 0.092353 0.094490 0.091227 0.110542 0.125224 0.112895 0.147929 0.145241 0.160368 0.146534 0.147891 0.107712 0.159986 0.162881 0.161052
qa: -0.2685 -0.5022 -0.3413 0.1129 0.0154 -0.1078 -0.2689 -0.2713 -0.2921 0.4124 0.0026 -0.2737 -0.2746 0.0540 -0.0143 -0.1743 -0.2094 0.2930 -0.1229 -0.2611 0.2387 -0.2087 -0.0960 -0.1514 -0.2088 -0.1637 0.1182 0.0973 0.0949 0.0886 0.0952 0.0950 0.0906 0.1031 0.1241 0.1138 0.0947 0.0924 0.0945 0.0912 0.1105 0.1252 0.1129 0.1479 0.1452 0.1604 0.1465 0.1479 0.1077 0.1600 0.1629 0.1611
va: 2.1126 1.9866 2.0758 3.7587 3.7053 3.8220 3.9051 3.8924 3.8456 4.1284 3.7106 3.9294 3.9362 3.8179 3.6221 3.8479 3.9262 3.6955 3.8426 3.9623 3.7719 3.9634 3.7558 3.9072 3.9308 3.8957 1.0001 1.0273 1.0019 1.0058 1.0018 1.0008 1.0112 1.0009 1.0002 0.9996 0.9893 1.0054 1.0108 0.9960 1.0003 1.0156 1.0034 1.0229 1.0019 0.9874 1.0070 1.0073 1.0302 0.9883 0.9913 0.9894
dispcorr: -0.031617934 hartree
energy: -1117.881599367475
dipole: -17.87931 16.77378 -1.10553 -8.29670 8.46503 0.16833 -13.62004 12.32298 -1.29706
magnitude: 1.71257 au
magnitude: 4.35302 debye
