program: Orca
programVersion: 5.0.2
elementType: O O O C C C C C C C C C C C C C C C C C C C C C C C H H H H H H H H H H H H H H H H H H H H H H H H H H
charge: 0
multiplicity: 1
keywords: wb97x-d3
keywords: def2-TZVPP
keywords: def2/J RIJCOSX
keywords: DEFGRID2
keywords: scfconv7
keywords: smallprint printgap noloewdin
keywords: NOSOSCF
formula: C23H26O3
InChI: InChI=1/C23H26O3/c1-16(2)13-20-21(23(20,3)4)22(24)25-15-17-9-8-12-19(14-17)26-18-10-6-5-7-11-18/h5-14,20-21H,15H2,1-4H3
52 atoms
O  -2.225266 1.423433 -1.554629
O  -2.307346 -0.746895 -1.031014
O  3.692963 0.260808 -1.527866
C  -5.221034 -0.18946 -0.080482
C  -4.360808 0.177208 1.07865
C  -4.050369 0.744284 -0.317077
C  -6.572194 0.483242 -0.163555
C  -5.242535 -1.593108 -0.632941
C  -3.457251 -0.783396 1.752822
C  -2.80384 0.355342 -0.987933
C  -2.549154 -0.45356 2.676736
C  -1.71433 -1.498044 3.352053
C  -2.27731 0.951953 3.116061
C  -0.967049 1.245255 -2.189843
C  0.17787 1.091646 -1.224277
C  1.403911 0.689622 -1.741384
C  0.068267 1.372969 0.132821
C  2.513471 0.586641 -0.915596
C  1.181664 1.244056 0.952401
C  2.412289 0.858089 0.443911
C  4.685946 -0.379118 -0.825264
C  5.964237 0.152956 -0.894617
C  4.438901 -1.555284 -0.128881
C  7.011662 -0.507897 -0.267319
C  5.492866 -2.199384 0.502409
C  6.780461 -1.681857 0.435576
H  -4.774023 0.941251 1.72972
H  -4.311448 1.787144 -0.451795
H  -6.917622 0.53792 -1.197566
H  -6.547087 1.498173 0.234656
H  -7.314056 -0.079696 0.40576
H  -4.307178 -2.134273 -0.528324
H  -5.499822 -1.578853 -1.693373
H  -6.013455 -2.170078 -0.118967
H  -3.56842 -1.833309 1.502024
H  -0.650503 -1.323185 3.171065
H  -1.955029 -2.503726 3.008373
H  -1.850871 -1.46862 4.436155
H  -1.21225 1.181055 3.02559
H  -2.52813 1.081539 4.172322
H  -2.826821 1.699478 2.546975
H  -0.825763 2.149024 -2.783521
H  -0.995722 0.403923 -2.885934
H  1.502357 0.462938 -2.79724
H  -0.868127 1.699465 0.565768
H  1.092493 1.460218 2.009336
H  3.270204 0.782987 1.09896
H  6.139285 1.069794 -1.443045
H  3.440065 -1.971231 -0.085085
H  8.010698 -0.096523 -0.326716
H  5.304728 -3.117153 1.043825
H  7.597965 -2.192422 0.926643
elementType: O C H
totalener: -1117.85355661 hartree
nucrepener: 2230.87593148 hartree
electener: -3348.72948808 hartree
oneelecener: -5951.97279054 hartree
twoeener: 2603.24330246 hartree
cpcmener: -0.03338224 hartree
kineticenergy: 1112.79063847 hartree
xcener: -110.228744107713 hartree
chargesum: -0.0000000
charge: -0.304331 -0.488656 -0.339012 0.137254 -0.022804 -0.078381 -0.259419 -0.297254 -0.260887 0.381000 -0.026627 -0.224302 -0.294331 0.090064 0.031893 -0.272466 -0.234207 0.285378 -0.165795 -0.193168 0.267126 -0.233623 -0.186678 -0.134056 -0.149351 -0.178034 0.112718 0.093735 0.095649 0.088121 0.095427 0.089641 0.103216 0.100349 0.128716 0.091917 0.089699 0.096137 0.092485 0.115404 0.095016 0.131308 0.117411 0.131221 0.167818 0.163285 0.155408 0.148553 0.161825 0.161435 0.162832 0.161341
qa: -0.3043 -0.4887 -0.3390 0.1373 -0.0228 -0.0784 -0.2594 -0.2973 -0.2609 0.3810 -0.0266 -0.2243 -0.2943 0.0901 0.0319 -0.2725 -0.2342 0.2854 -0.1658 -0.1932 0.2671 -0.2336 -0.1867 -0.1341 -0.1494 -0.1780 0.1127 0.0937 0.0956 0.0881 0.0954 0.0896 0.1032 0.1003 0.1287 0.0919 0.0897 0.0961 0.0925 0.1154 0.0950 0.1313 0.1174 0.1312 0.1678 0.1633 0.1554 0.1486 0.1618 0.1614 0.1628 0.1613
va: 2.1084 1.9904 2.0586 3.7789 3.7775 3.8434 3.8919 3.8931 3.8345 4.0879 3.6951 3.9256 3.9568 3.8045 3.6863 4.0774 3.9232 3.7155 3.9303 3.9126 3.6832 4.0044 3.9220 3.8816 3.8850 3.8903 1.0024 1.0317 1.0026 1.0044 1.0022 1.0195 0.9991 0.9991 1.0006 0.9972 1.0079 0.9957 0.9942 1.0006 1.0053 0.9911 1.0121 1.0186 0.9918 0.9905 0.9986 1.0064 0.9947 0.9883 0.9891 0.9893
dispcorr: -0.025555258 hartree
energy: -1117.879111864147
dipole: -24.61090 24.27036 -0.34054 -3.51173 4.34241 0.83068 14.62514 -13.80407 0.82106
magnitude: 1.21661 au
magnitude: 3.09237 debye
