program: Orca
programVersion: 5.0.2
elementType: O O O C C C C C C C C C C C C C C C C C C C C C C C H H H H H H H H H H H H H H H H H H H H H H H H H H
charge: 0
multiplicity: 1
keywords: wb97x-d3
keywords: def2-TZVPP
keywords: def2/J RIJCOSX
keywords: DEFGRID2
keywords: scfconv7
keywords: smallprint printgap noloewdin
keywords: NOSOSCF
formula: C23H26O3
InChI: InChI=1/C23H26O3/c1-16(2)13-20-21(23(20,3)4)22(24)25-15-17-9-8-12-19(14-17)26-18-10-6-5-7-11-18/h5-14,20-21H,15H2,1-4H3
52 atoms
O  -2.226323 1.410619 -1.558854
O  -2.318461 -0.764931 -1.060602
O  3.713467 0.347314 -1.474801
C  -5.22233 -0.215573 -0.085434
C  -4.353242 0.159142 1.064559
C  -4.060154 0.723543 -0.337223
C  -6.576911 0.451989 -0.155714
C  -5.24507 -1.620586 -0.634412
C  -3.42742 -0.788923 1.725889
C  -2.813047 0.337685 -1.009361
C  -2.515275 -0.444789 2.640465
C  -1.635085 -1.471869 3.283855
C  -2.279633 0.962541 3.096245
C  -0.959825 1.23637 -2.177725
C  0.173649 1.082003 -1.198111
C  1.418026 0.731596 -1.710159
C  0.036595 1.30718 0.166546
C  2.516427 0.624016 -0.871007
C  1.140943 1.178188 0.998811
C  2.388733 0.845804 0.495538
C  4.696365 -0.332302 -0.797569
C  5.98958 0.159119 -0.896052
C  4.430524 -1.502447 -0.097367
C  7.029468 -0.53124 -0.289008
C  5.477859 -2.174966 0.515318
C  6.778282 -1.695317 0.423706
H  -4.76472 0.921105 1.718971
H  -4.325817 1.764993 -0.474001
H  -6.932971 0.503999 -1.186236
H  -6.551386 1.467608 0.24074
H  -7.311053 -0.112581 0.421957
H  -6.008897 -2.198504 -0.111094
H  -4.307098 -2.158719 -0.538496
H  -5.513407 -1.609473 -1.692128
H  -3.515535 -1.838422 1.464855
H  -0.583751 -1.274637 3.056614
H  -1.86874 -2.482779 2.950787
H  -1.72594 -1.443376 4.372699
H  -1.215448 1.207157 3.05149
H  -2.575979 1.0831 4.141902
H  -2.816316 1.705428 2.509254
H  -0.811797 2.141233 -2.767882
H  -0.977784 0.39635 -2.875641
H  1.538928 0.54829 -2.772119
H  -0.914196 1.591659 0.597369
H  1.029704 1.352682 2.061399
H  3.239454 0.770107 1.159839
H  6.180367 1.070359 -1.448629
H  3.421947 -1.890656 -0.031458
H  8.038769 -0.149622 -0.370006
H  5.273041 -3.08586 1.062285
H  7.58976 -2.22817 0.900844
elementType: O C H
totalener: -1117.85333907 hartree
nucrepener: 2234.75030161 hartree
electener: -3352.60364068 hartree
oneelecener: -5959.64499574 hartree
twoeener: 2607.04135506 hartree
cpcmener: -0.03316307 hartree
kineticenergy: 1112.79035733 hartree
xcener: -110.229469806286 hartree
chargesum: 0.0000000
charge: -0.304128 -0.487585 -0.339082 0.137008 -0.024408 -0.078994 -0.260101 -0.295889 -0.256499 0.378661 -0.031588 -0.222590 -0.300082 0.087438 0.029293 -0.273977 -0.225266 0.290007 -0.171087 -0.197858 0.284060 -0.244505 -0.197372 -0.129112 -0.145959 -0.184747 0.112772 0.093672 0.095772 0.088193 0.095586 0.099940 0.089657 0.102895 0.128783 0.091201 0.089714 0.096442 0.095633 0.117468 0.095968 0.132163 0.117609 0.131281 0.174179 0.163604 0.156152 0.148285 0.161574 0.161602 0.162865 0.161350
qa: -0.3041 -0.4876 -0.3391 0.1370 -0.0244 -0.0790 -0.2601 -0.2959 -0.2565 0.3787 -0.0316 -0.2226 -0.3001 0.0874 0.0293 -0.2740 -0.2253 0.2900 -0.1711 -0.1979 0.2841 -0.2445 -0.1974 -0.1291 -0.1460 -0.1847 0.1128 0.0937 0.0958 0.0882 0.0956 0.0999 0.0897 0.1029 0.1288 0.0912 0.0897 0.0964 0.0956 0.1175 0.0960 0.1322 0.1176 0.1313 0.1742 0.1636 0.1562 0.1483 0.1616 0.1616 0.1629 0.1613
va: 2.1081 1.9910 2.0613 3.7798 3.7791 3.8399 3.8922 3.8917 3.8289 4.0929 3.6984 3.9256 3.9569 3.8083 3.6954 4.0789 3.9179 3.7108 3.9334 3.9251 3.6716 4.0078 3.9187 3.8799 3.8833 3.8959 1.0020 1.0317 1.0026 1.0042 1.0022 0.9992 1.0200 0.9990 1.0012 0.9970 1.0081 0.9957 0.9929 1.0001 1.0044 0.9912 1.0123 1.0183 0.9852 0.9905 0.9979 1.0071 0.9949 0.9881 0.9891 0.9894
dispcorr: -0.025798442 hartree
energy: -1117.879137513990
dipole: -24.50774 24.13442 -0.37332 -3.70037 4.51033 0.80996 14.43288 -13.61148 0.82140
magnitude: 1.21248 au
magnitude: 3.08188 debye
