program: Orca
programVersion: 5.0.2
elementType: O O O C C C C C C C C C C C C C C C C C C C C C C C H H H H H H H H H H H H H H H H H H H H H H H H H H
charge: 0
multiplicity: 1
keywords: wb97x-d3
keywords: def2-TZVPP
keywords: def2/J RIJCOSX
keywords: DEFGRID2
keywords: scfconv7
keywords: smallprint printgap noloewdin
keywords: NOSOSCF
formula: C23H26O3
InChI: InChI=1/C23H26O3/c1-16(2)13-20-21(23(20,3)4)22(24)25-15-17-9-8-12-19(14-17)26-18-10-6-5-7-11-18/h5-14,20-21H,15H2,1-4H3
52 atoms
O  -2.146571 2.39249 -0.164075
O  -2.614916 0.880775 -1.737037
O  2.075154 -0.261497 0.403808
C  -4.502075 -0.481605 0.301928
C  -3.222968 -0.642766 1.073106
C  -3.599082 0.712135 0.458567
C  -5.772131 -0.41519 1.119002
C  -4.70078 -1.192918 -1.015323
C  -2.070192 -1.416237 0.573608
C  -2.767018 1.294196 -0.611217
C  -1.314935 -2.254343 1.293612
C  -0.160036 -2.972727 0.663282
C  -1.513797 -2.56918 2.745073
C  -1.212949 3.021696 -1.03927
C  0.0052 2.179231 -1.301167
C  0.52684 1.34635 -0.317273
C  0.643522 2.269135 -2.532384
C  1.664262 0.59727 -0.580179
C  1.792243 1.530006 -2.775151
C  2.310152 0.683194 -1.807442
C  3.415505 -0.483771 0.597659
C  3.833755 -1.798029 0.742852
C  4.316853 0.567817 0.707967
C  5.170332 -2.060939 1.010873
C  5.651043 0.289707 0.966375
C  6.083793 -1.021675 1.118637
H  -3.342896 -0.644977 2.150202
H  -3.913169 1.447275 1.191172
H  -6.553759 0.123903 0.580163
H  -5.616864 0.089767 2.073332
H  -6.14572 -1.418854 1.330055
H  -5.182428 -2.153998 -0.826502
H  -3.783347 -1.394938 -1.55967
H  -5.360984 -0.622155 -1.67014
H  -1.806439 -1.29097 -0.471398
H  -0.327078 -4.05312 0.668868
H  0.760587 -2.804489 1.227265
H  0.009228 -2.66218 -0.36745
H  -2.438987 -2.178327 3.163683
H  -0.685544 -2.174432 3.340047
H  -1.513115 -3.650716 2.901273
H  -0.933384 3.94097 -0.524029
H  -1.691932 3.305569 -1.978475
H  0.053466 1.260329 0.653551
H  0.238058 2.910643 -3.304882
H  2.282544 1.596524 -3.737364
H  3.193037 0.093017 -2.016345
H  3.117714 -2.605607 0.653112
H  3.984284 1.59288 0.601452
H  5.496914 -3.08589 1.127626
H  6.354649 1.106952 1.055606
H  7.125205 -1.230563 1.323453
elementType: O C H
totalener: -1117.85277491 hartree
nucrepener: 2297.71216796 hartree
electener: -3415.56494287 hartree
oneelecener: -6085.98166609 hartree
twoeener: 2670.41672322 hartree
cpcmener: -0.03200594 hartree
kineticenergy: 1112.79755801 hartree
xcener: -110.229132131534 hartree
chargesum: 0.0000000
charge: -0.295362 -0.477985 -0.340325 0.124639 0.056140 -0.118750 -0.268120 -0.282894 -0.335051 0.401374 -0.021552 -0.250550 -0.261979 0.096562 0.065844 -0.310170 -0.229627 0.289299 -0.126698 -0.212393 0.259174 -0.238263 -0.170442 -0.144340 -0.157782 -0.174146 0.113031 0.102058 0.094401 0.088714 0.095440 0.094813 0.091291 0.102489 0.119434 0.110022 0.089902 0.093786 0.090603 0.101491 0.095641 0.123824 0.118370 0.130914 0.144864 0.161778 0.158239 0.157165 0.160280 0.161674 0.162241 0.160931
qa: -0.2954 -0.4780 -0.3403 0.1246 0.0561 -0.1187 -0.2681 -0.2829 -0.3351 0.4014 -0.0216 -0.2505 -0.2620 0.0966 0.0658 -0.3102 -0.2296 0.2893 -0.1267 -0.2124 0.2592 -0.2383 -0.1704 -0.1443 -0.1578 -0.1741 0.1130 0.1021 0.0944 0.0887 0.0954 0.0948 0.0913 0.1025 0.1194 0.1100 0.0899 0.0938 0.0906 0.1015 0.0956 0.1238 0.1184 0.1309 0.1449 0.1618 0.1582 0.1572 0.1603 0.1617 0.1622 0.1609
va: 2.1083 2.0150 2.0248 3.7141 3.7364 3.8493 3.9058 3.8965 3.8534 4.1138 3.7219 3.9255 3.9436 3.7892 3.5947 4.0396 3.9736 3.6712 3.8978 3.9413 3.7089 3.9768 3.9153 3.9094 3.8994 3.8883 1.0047 1.0275 1.0019 1.0043 1.0019 1.0012 1.0105 1.0009 1.0183 0.9987 0.9955 1.0074 1.0113 0.9962 0.9972 0.9931 1.0088 1.0308 1.0026 0.9890 0.9975 1.0012 0.9948 0.9898 0.9892 0.9890
dispcorr: -0.026686510 hartree
energy: -1117.879461419554
dipole: -15.35299 15.85391 0.50092 -13.54205 13.92450 0.38245 7.06407 -6.19732 0.86674
magnitude: 1.07165 au
magnitude: 2.72392 debye
