program: Orca
programVersion: 5.0.2
elementType: O O O C C C C C C C C C C C C C C C C C C C C C C C H H H H H H H H H H H H H H H H H H H H H H H H H H
charge: 0
multiplicity: 1
keywords: wb97x-d3
keywords: def2-TZVPP
keywords: def2/J RIJCOSX
keywords: DEFGRID2
keywords: scfconv7
keywords: smallprint printgap noloewdin
keywords: NOSOSCF
formula: C23H26O3
InChI: InChI=1/C23H26O3/c1-16(2)13-20-21(23(20,3)4)22(24)25-15-17-9-8-12-19(14-17)26-18-10-6-5-7-11-18/h5-14,20-21H,15H2,1-4H3
52 atoms
O  -2.362686 1.932276 -0.766704
O  -2.250263 -0.125716 -1.636123
O  2.758676 -0.001233 -1.174692
C  -4.552495 -0.882243 0.276074
C  -3.324377 -0.989589 1.107596
C  -3.590919 0.29202 0.305235
C  -5.851619 -0.633083 1.007267
C  -4.739676 -1.730622 -0.957749
C  -2.191078 -1.882412 0.761986
C  -2.685995 0.634912 -0.801303
C  -0.919056 -1.635959 1.085369
C  0.185188 -2.558642 0.67174
C  -0.491827 -0.405677 1.825516
C  -1.423582 2.435703 -1.731771
C  -0.016038 2.346949 -1.212444
C  0.750769 1.200811 -1.406928
C  0.524654 3.414119 -0.502606
C  2.041039 1.135924 -0.902638
C  1.821012 3.34323 -0.012991
C  2.591736 2.209132 -0.21386
C  3.530547 -0.593284 -0.208816
C  3.247363 -0.511553 1.149592
C  4.60251 -1.352546 -0.660367
C  4.056628 -1.186922 2.052436
C  5.395114 -2.030348 0.25377
C  5.132183 -1.946858 1.614538
H  -3.472587 -0.832164 2.172833
H  -3.91304 1.14355 0.892802
H  -5.70817 -0.012486 1.89235
H  -6.294404 -1.576909 1.330586
H  -6.574274 -0.131544 0.36087
H  -5.367036 -1.213626 -1.685815
H  -5.254677 -2.652948 -0.683106
H  -3.816021 -2.009937 -1.45485
H  -2.42038 -2.786786 0.206292
H  -0.190428 -3.438328 0.149165
H  0.769802 -2.895074 1.531432
H  0.882677 -2.045685 0.004021
H  0.059665 0.268493 1.16388
H  0.187121 -0.659996 2.642406
H  -1.325251 0.154866 2.244906
H  -1.704714 3.477276 -1.878126
H  -1.533515 1.920487 -2.685463
H  0.354473 0.357603 -1.958214
H  -0.063745 4.309521 -0.345333
H  2.242862 4.183172 0.522743
H  3.606925 2.16893 0.159677
H  2.405457 0.062294 1.512699
H  4.809202 -1.415472 -1.721164
H  3.834265 -1.118055 3.109144
H  6.227666 -2.621882 -0.103727
H  5.756345 -2.470833 2.325671
elementType: O C H
totalener: -1117.85205532 hartree
nucrepener: 2338.65616425 hartree
electener: -3456.50821957 hartree
oneelecener: -6167.47956543 hartree
twoeener: 2710.97134586 hartree
cpcmener: -0.02945357 hartree
kineticenergy: 1112.80703667 hartree
xcener: -110.231799762851 hartree
chargesum: 0.0000000
charge: -0.296581 -0.497393 -0.342706 0.130559 -0.012543 -0.118146 -0.266231 -0.299370 -0.272218 0.420835 0.005745 -0.236756 -0.275063 0.079243 0.004246 -0.254899 -0.198451 0.289121 -0.133198 -0.204608 0.329935 -0.219047 -0.263143 -0.169471 -0.132203 -0.180179 0.111979 0.094280 0.087877 0.094735 0.095780 0.101851 0.099202 0.093302 0.125809 0.100510 0.098535 0.081124 0.066798 0.111774 0.109305 0.120349 0.117119 0.135140 0.145981 0.162976 0.157285 0.170775 0.147527 0.160428 0.160983 0.161095
qa: -0.2966 -0.4974 -0.3427 0.1306 -0.0125 -0.1181 -0.2662 -0.2994 -0.2722 0.4208 0.0057 -0.2368 -0.2751 0.0792 0.0042 -0.2549 -0.1985 0.2891 -0.1332 -0.2046 0.3299 -0.2190 -0.2631 -0.1695 -0.1322 -0.1802 0.1120 0.0943 0.0879 0.0947 0.0958 0.1019 0.0992 0.0933 0.1258 0.1005 0.0985 0.0811 0.0668 0.1118 0.1093 0.1203 0.1171 0.1351 0.1460 0.1630 0.1573 0.1708 0.1475 0.1604 0.1610 0.1611
va: 2.1088 1.9854 2.0391 3.7472 3.8174 3.8392 3.9005 3.8894 3.8384 4.0749 3.6180 3.9331 3.9450 3.8053 3.6386 3.9544 3.9674 3.7037 3.8875 3.9261 3.5661 3.8406 4.0059 3.9203 3.8891 3.8952 1.0063 1.0310 1.0041 1.0021 1.0023 1.0004 0.9984 1.0169 1.0009 1.0120 0.9973 0.9979 1.0095 0.9996 1.0109 0.9965 1.0155 1.0351 1.0015 0.9882 0.9957 0.9858 1.0081 0.9915 0.9879 0.9888
dispcorr: -0.029654958 hartree
energy: -1117.881710277447
dipole: -15.70771 15.65982 -0.04789 -9.41214 10.36938 0.95725 9.43060 -8.10198 1.32862
magnitude: 1.63825 au
magnitude: 4.16409 debye
