program: Orca
programVersion: 5.0.2
elementType: O O O C C C C C C C C C C C C C C C C C C C C C C C H H H H H H H H H H H H H H H H H H H H H H H H H H
charge: 0
multiplicity: 1
keywords: wb97x-d3
keywords: def2-TZVPP
keywords: def2/J RIJCOSX
keywords: DEFGRID2
keywords: scfconv7
keywords: smallprint printgap noloewdin
keywords: NOSOSCF
formula: C23H26O3
InChI: InChI=1/C23H26O3/c1-16(2)13-20-21(23(20,3)4)22(24)25-15-17-9-8-12-19(14-17)26-18-10-6-5-7-11-18/h5-14,20-21H,15H2,1-4H3
52 atoms
O  -1.961149 1.809775 -1.433133
O  -1.551613 1.642213 0.754367
O  2.691323 -0.057701 -2.01848
C  -2.124837 -1.398831 -0.11415
C  -3.251255 -0.945621 0.765502
C  -2.805694 -0.065495 -0.391369
C  -2.417461 -2.495406 -1.107874
C  -0.711137 -1.442545 0.409585
C  -3.074272 -0.614661 2.192806
C  -2.058295 1.194427 -0.248087
C  -3.928407 -0.922455 3.17633
C  -3.612764 -0.562609 4.597101
C  -5.238141 -1.628389 3.000525
C  -1.118146 2.959081 -1.505831
C  0.333843 2.624839 -1.299342
C  0.858985 1.411803 -1.736718
C  1.169214 3.545641 -0.679911
C  2.202308 1.13812 -1.545321
C  2.518401 3.264293 -0.50954
C  3.046827 2.05728 -0.937254
C  3.266885 -0.931979 -1.134107
C  4.180648 -1.837498 -1.65943
C  2.940657 -0.961447 0.216825
C  4.767413 -2.777987 -0.826326
C  3.542087 -1.905297 1.038398
C  4.456679 -2.815085 0.526927
H  -4.194157 -1.428216 0.535337
H  -3.465396 -0.073347 -1.251679
H  -1.755249 -2.424887 -1.972968
H  -3.445648 -2.453291 -1.46856
H  -2.264164 -3.475565 -0.651767
H  0.000372 -1.399568 -0.417055
H  -0.543947 -2.38543 0.933974
H  -0.4634 -0.640414 1.100304
H  -2.160367 -0.10981 2.47871
H  -4.39104 0.078323 5.019297
H  -2.660202 -0.041627 4.689766
H  -3.57301 -1.453045 5.230118
H  -5.47535 -1.87722 1.968873
H  -6.056089 -1.017431 3.389982
H  -5.251382 -2.558772 3.574207
H  -1.441484 3.724123 -0.797271
H  -1.27907 3.35221 -2.50969
H  0.233951 0.669492 -2.218754
H  0.766348 4.485322 -0.323191
H  3.163005 3.98868 -0.02966
H  4.096874 1.833386 -0.796992
H  4.42608 -1.806287 -2.713493
H  2.223117 -0.267269 0.634819
H  5.478383 -3.48079 -1.240673
H  3.285349 -1.924837 2.089431
H  4.921413 -3.545784 1.17508
elementType: O C H
totalener: -1117.85297174 hartree
nucrepener: 2288.96340968 hartree
electener: -3406.81638142 hartree
oneelecener: -6068.04823442 hartree
twoeener: 2661.23185299 hartree
cpcmener: -0.03120172 hartree
kineticenergy: 1112.80267049 hartree
xcener: -110.230852952302 hartree
chargesum: -0.0000000
charge: -0.295579 -0.481836 -0.344802 0.132473 0.022255 -0.077017 -0.264280 -0.301182 -0.296393 0.382004 -0.059826 -0.219823 -0.255367 0.096176 0.039118 -0.294733 -0.207765 0.264225 -0.132559 -0.179610 0.318841 -0.248382 -0.215701 -0.132791 -0.175514 -0.186842 0.122829 0.100649 0.094198 0.088999 0.095844 0.089463 0.110995 0.097837 0.117288 0.093220 0.088900 0.093264 0.089031 0.096185 0.096887 0.118142 0.123912 0.141348 0.144750 0.162469 0.160124 0.147527 0.156907 0.160689 0.161720 0.161731
qa: -0.2956 -0.4818 -0.3448 0.1325 0.0223 -0.0770 -0.2643 -0.3012 -0.2964 0.3820 -0.0598 -0.2198 -0.2554 0.0962 0.0391 -0.2947 -0.2078 0.2642 -0.1326 -0.1796 0.3188 -0.2484 -0.2157 -0.1328 -0.1755 -0.1868 0.1228 0.1006 0.0942 0.0890 0.0958 0.0895 0.1110 0.0978 0.1173 0.0932 0.0889 0.0933 0.0890 0.0962 0.0969 0.1181 0.1239 0.1413 0.1448 0.1625 0.1601 0.1475 0.1569 0.1607 0.1617 0.1617
va: 2.1079 2.0020 2.0408 3.7086 3.7549 3.8269 3.9020 3.8993 3.8432 4.1320 3.7902 3.9202 3.9371 3.7956 3.5997 4.0203 3.9674 3.7222 3.8854 3.9448 3.6233 3.9974 3.8560 3.8944 3.9220 3.8960 0.9996 1.0289 1.0029 1.0055 1.0010 1.0022 1.0034 1.0073 1.0235 0.9962 1.0088 0.9963 1.0144 0.9972 0.9965 1.0094 0.9931 1.0209 1.0017 0.9886 0.9946 1.0080 0.9955 0.9880 0.9905 0.9887
dispcorr: -0.026365108 hartree
energy: -1117.879336847440
dipole: -18.76698 18.35779 -0.40919 -13.48378 13.11545 -0.36833 15.36035 -15.60800 -0.24765
magnitude: 0.60368 au
magnitude: 1.53442 debye
