program: Orca
programVersion: 5.0.2
elementType: O O O C C C C C C C C C C C C C C C C C C C C C C C H H H H H H H H H H H H H H H H H H H H H H H H H H
charge: 0
multiplicity: 1
keywords: wb97x-d3
keywords: def2-TZVPP
keywords: def2/J RIJCOSX
keywords: DEFGRID2
keywords: scfconv7
keywords: smallprint printgap noloewdin
keywords: NOSOSCF
formula: C23H26O3
InChI: InChI=1/C23H26O3/c1-16(2)13-20-21(23(20,3)4)22(24)25-15-17-9-8-12-19(14-17)26-18-10-6-5-7-11-18/h5-14,20-21H,15H2,1-4H3
52 atoms
O  -1.066749 0.882968 -1.38901
O  -1.71788 1.319837 0.701989
O  3.959198 0.501969 -0.175828
C  -1.857825 -1.788776 0.964742
C  -3.228867 -1.335192 0.615608
C  -2.043387 -0.865552 -0.232759
C  -1.486995 -3.208785 0.610634
C  -1.171319 -1.30527 2.217033
C  -4.022537 -0.407522 1.454935
C  -1.612226 0.537665 -0.215534
C  -5.019207 0.338581 0.972276
C  -5.831668 1.234627 1.852803
C  -5.361779 0.338846 -0.491462
C  -0.476087 2.183984 -1.476915
C  0.776013 2.277788 -0.650188
C  1.776942 1.325527 -0.821223
C  0.940554 3.295909 0.279528
C  2.924889 1.389091 -0.044964
C  2.107507 3.366216 1.028648
C  3.099221 2.410953 0.881024
C  3.723356 -0.781307 -0.608237
C  4.56122 -1.281329 -1.593805
C  2.732998 -1.576805 -0.043453
C  4.408548 -2.594336 -2.018391
C  2.584956 -2.883464 -0.485919
C  3.417166 -3.397312 -1.472711
H  -3.828127 -2.06422 0.074245
H  -1.943032 -1.345055 -1.199064
H  -0.408795 -3.308265 0.472086
H  -1.975006 -3.54132 -0.306018
H  -1.782255 -3.889632 1.411271
H  -0.088405 -1.291268 2.075391
H  -1.383596 -1.995203 3.03578
H  -1.476835 -0.314611 2.540998
H  -3.794703 -0.361745 2.515518
H  -6.891873 0.972231 1.808665
H  -5.759159 2.274425 1.523437
H  -5.513736 1.186677 2.894206
H  -6.234991 0.956315 -0.701285
H  -5.573847 -0.666609 -0.861778
H  -4.535671 0.726492 -1.093996
H  -1.191203 2.958218 -1.194613
H  -0.250754 2.309242 -2.535411
H  1.654667 0.541507 -1.558882
H  0.158154 4.030585 0.421291
H  2.238411 4.160089 1.752036
H  4.002882 2.454771 1.475379
H  5.330228 -0.649723 -2.020352
H  2.083415 -1.19058 0.733263
H  5.065007 -2.98449 -2.785204
H  1.814672 -3.505453 -0.048548
H  3.295293 -4.417884 -1.810061
elementType: O C H
totalener: -1117.85163024 hartree
nucrepener: 2309.56230732 hartree
electener: -3427.41393755 hartree
oneelecener: -6109.23917183 hartree
twoeener: 2681.82523427 hartree
cpcmener: -0.03291414 hartree
kineticenergy: 1112.79911204 hartree
xcener: -110.227546176158 hartree
chargesum: 0.0000000
charge: -0.304987 -0.491613 -0.340481 0.120483 -0.036827 -0.068669 -0.259409 -0.290163 -0.270300 0.384964 -0.017808 -0.225448 -0.273840 0.102428 0.021904 -0.246517 -0.228132 0.295676 -0.113181 -0.262996 0.281353 -0.236125 -0.213565 -0.131224 -0.164607 -0.183477 0.119737 0.094512 0.085058 0.089587 0.096323 0.096025 0.103528 0.092323 0.127044 0.097684 0.099150 0.086011 0.099100 0.100483 0.098877 0.114158 0.125617 0.138673 0.145404 0.160709 0.148532 0.148734 0.177953 0.161321 0.184833 0.161185
qa: -0.3050 -0.4916 -0.3405 0.1205 -0.0368 -0.0687 -0.2594 -0.2902 -0.2703 0.3850 -0.0178 -0.2254 -0.2738 0.1024 0.0219 -0.2465 -0.2281 0.2957 -0.1132 -0.2630 0.2814 -0.2361 -0.2136 -0.1312 -0.1646 -0.1835 0.1197 0.0945 0.0851 0.0896 0.0963 0.0960 0.1035 0.0923 0.1270 0.0977 0.0991 0.0860 0.0991 0.1005 0.0989 0.1142 0.1256 0.1387 0.1454 0.1607 0.1485 0.1487 0.1780 0.1613 0.1848 0.1612
va: 2.0959 1.9893 2.0675 3.7671 3.8354 3.8086 3.8986 3.8913 3.8010 4.0773 3.6925 3.9212 3.9511 3.8044 3.6308 3.9268 3.9502 3.6955 3.8928 4.0050 3.7023 3.9986 3.9333 3.8850 3.8847 3.9178 1.0016 1.0308 1.0105 1.0053 1.0034 1.0044 0.9993 1.0171 0.9988 0.9937 0.9933 1.0082 1.0057 0.9979 0.9987 1.0087 0.9932 1.0171 1.0043 0.9878 1.0064 1.0066 0.9786 0.9880 0.9762 0.9907
dispcorr: -0.026770220 hartree
energy: -1117.878400459187
dipole: -25.50516 25.00546 -0.49970 -8.46636 7.54408 -0.92228 6.08942 -7.00886 -0.91944
magnitude: 1.39487 au
magnitude: 3.54548 debye
