program: Orca
programVersion: 5.0.2
elementType: O O O C C C C C C C C C C C C C C C C C C C C C C C H H H H H H H H H H H H H H H H H H H H H H H H H H
charge: 0
multiplicity: 1
keywords: wb97x-d3
keywords: def2-TZVPP
keywords: def2/J RIJCOSX
keywords: DEFGRID2
keywords: scfconv7
keywords: smallprint printgap noloewdin
keywords: NOSOSCF
formula: C23H26O3
InChI: InChI=1/C23H26O3/c1-16(2)13-20-21(23(20,3)4)22(24)25-15-17-9-8-12-19(14-17)26-18-10-6-5-7-11-18/h5-14,20-21H,15H2,1-4H3
52 atoms
O  -1.109584 0.869347 -1.407616
O  -1.689412 1.322079 0.70052
O  3.936872 0.491107 -0.251441
C  -1.834911 -1.798562 0.952067
C  -3.220072 -1.325157 0.691859
C  -2.083775 -0.859313 -0.220511
C  -1.499347 -3.217586 0.560669
C  -1.070538 -1.332917 2.165972
C  -3.948298 -0.406132 1.598686
C  -1.625774 0.536153 -0.217354
C  -4.952788 0.376467 1.197221
C  -5.710533 1.24208 2.15397
C  -5.382162 0.429795 -0.241997
C  -0.513309 2.165276 -1.521295
C  0.753472 2.269292 -0.718195
C  1.746798 1.307648 -0.882151
C  0.938599 3.309261 0.182848
C  2.907782 1.384833 -0.1265
C  2.116301 3.389955 0.913906
C  3.10134 2.426978 0.772723
C  3.691537 -0.795035 -0.669741
C  2.71832 -1.586147 -0.070945
C  4.500098 -1.300631 -1.676099
C  2.558175 -2.895846 -0.499322
C  4.335722 -2.616634 -2.086993
C  3.362337 -3.416247 -1.505589
H  -3.859465 -2.041509 0.180422
H  -2.047141 -1.330139 -1.195605
H  -0.433424 -3.323526 0.350431
H  -2.048753 -3.537222 -0.325499
H  -1.746763 -3.904481 1.372357
H  -1.348654 -0.342806 2.516466
H  0.001886 -1.324746 1.959405
H  -1.238386 -2.028505 2.990366
H  -3.668516 -0.408233 2.647763
H  -5.63394 2.295164 1.871546
H  -5.350866 1.138726 3.177624
H  -6.776105 0.998513 2.142758
H  -6.103527 1.227564 -0.417185
H  -5.852905 -0.505424 -0.555139
H  -4.536703 0.595211 -0.913042
H  -1.220769 2.946323 -1.23744
H  -0.305861 2.276421 -2.585283
H  1.608113 0.5063 -1.597833
H  0.160743 4.049317 0.321277
H  2.262598 4.200548 1.61546
H  4.015844 2.481395 1.34938
H  2.091706 -1.192596 0.720508
H  5.256186 -0.671413 -2.127845
H  1.801392 -3.515483 -0.036295
H  4.970217 -3.012912 -2.86864
H  3.231221 -4.439288 -1.831606
elementType: O C H
totalener: -1117.85155204 hartree
nucrepener: 2311.51534230 hartree
electener: -3429.36689434 hartree
oneelecener: -6113.17023707 hartree
twoeener: 2683.80334272 hartree
cpcmener: -0.03317762 hartree
kineticenergy: 1112.80289598 hartree
xcener: -110.228397008737 hartree
chargesum: 0.0000000
charge: -0.305473 -0.490553 -0.340647 0.121793 -0.035776 -0.069974 -0.260351 -0.291829 -0.275706 0.386734 -0.015306 -0.224388 -0.275091 0.101615 0.025072 -0.248951 -0.231197 0.297089 -0.111602 -0.264227 0.280720 -0.217319 -0.232751 -0.164166 -0.132097 -0.183637 0.119008 0.095551 0.085806 0.090221 0.095926 0.093334 0.094905 0.104372 0.127709 0.096666 0.086184 0.099458 0.097715 0.104269 0.096420 0.114620 0.125352 0.138221 0.145227 0.160940 0.148511 0.183397 0.148941 0.182453 0.161597 0.161217
qa: -0.3055 -0.4906 -0.3406 0.1218 -0.0358 -0.0700 -0.2604 -0.2918 -0.2757 0.3867 -0.0153 -0.2244 -0.2751 0.1016 0.0251 -0.2490 -0.2312 0.2971 -0.1116 -0.2642 0.2807 -0.2173 -0.2328 -0.1642 -0.1321 -0.1836 0.1190 0.0956 0.0858 0.0902 0.0959 0.0933 0.0949 0.1044 0.1277 0.0967 0.0862 0.0995 0.0977 0.1043 0.0964 0.1146 0.1254 0.1382 0.1452 0.1609 0.1485 0.1834 0.1489 0.1825 0.1616 0.1612
va: 2.0962 1.9909 2.0676 3.7625 3.8380 3.8074 3.8982 3.8931 3.8041 4.0736 3.6884 3.9210 3.9510 3.8045 3.6292 3.9258 3.9512 3.6927 3.8917 4.0056 3.7054 3.9285 3.9982 3.8893 3.8846 3.9183 1.0009 1.0308 1.0114 1.0056 1.0032 1.0162 1.0059 0.9994 0.9984 0.9940 1.0083 0.9932 1.0052 0.9967 0.9995 1.0083 0.9931 1.0177 1.0042 0.9877 1.0065 0.9745 1.0065 0.9775 0.9880 0.9906
dispcorr: -0.026874879 hartree
energy: -1117.878426922391
dipole: -25.23214 24.68834 -0.54380 -8.37314 7.42712 -0.94602 6.95463 -7.86243 -0.90780
magnitude: 1.41943 au
magnitude: 3.60789 debye
