program: Orca
programVersion: 5.0.2
elementType: O O O C C C C C C C C C C C C C C C C C C C C C C C H H H H H H H H H H H H H H H H H H H H H H H H H H
charge: 0
multiplicity: 1
keywords: wb97x-d3
keywords: def2-TZVPP
keywords: def2/J RIJCOSX
keywords: DEFGRID2
keywords: scfconv7
keywords: smallprint printgap noloewdin
keywords: NOSOSCF
formula: C23H26O3
InChI: InChI=1/C23H26O3/c1-16(2)13-20-21(23(20,3)4)22(24)25-15-17-9-8-12-19(14-17)26-18-10-6-5-7-11-18/h5-14,20-21H,15H2,1-4H3
52 atoms
O  -1.85663 1.219927 -0.080454
O  -3.417545 1.843968 1.378712
O  2.972959 0.140204 -1.49956
C  -3.575806 -1.063332 -0.993016
C  -3.001101 -1.564365 0.287215
C  -3.71115 -0.20187 0.24704
C  -4.879205 -1.685594 -1.441448
C  -2.692775 -0.691121 -2.160679
C  -1.544852 -1.679732 0.537937
C  -2.996268 1.043969 0.567052
C  -1.009919 -1.736063 1.760851
C  0.461797 -1.912044 1.965023
C  -1.846265 -1.640121 3.005108
C  -1.05722 2.360954 0.256335
C  0.162203 2.3343 -0.616033
C  1.003961 1.224205 -0.613715
C  0.463185 3.427249 -1.419222
C  2.138941 1.225589 -1.411782
C  1.60263 3.415878 -2.212341
C  2.448054 2.319082 -2.21078
C  3.316307 -0.564506 -0.372879
C  3.464835 -1.937382 -0.512575
C  3.570388 0.057115 0.843514
C  3.867363 -2.695175 0.578235
C  3.962039 -0.71559 1.927796
C  4.110171 -2.09088 1.804057
H  -3.603657 -2.307336 0.803747
H  -4.697573 -0.202543 0.69567
H  -4.690763 -2.594938 -2.01511
H  -5.438961 -0.999551 -2.07983
H  -5.516996 -1.95152 -0.59769
H  -2.630106 -1.543326 -2.839894
H  -1.675533 -0.420784 -1.89332
H  -3.123386 0.139413 -2.7223
H  -0.886788 -1.757595 -0.322354
H  0.998126 -2.009999 1.021581
H  0.672092 -2.800074 2.567195
H  0.882435 -1.064571 2.511966
H  -2.312126 -2.60007 3.24416
H  -2.650963 -0.909656 2.909326
H  -1.242157 -1.35853 3.868026
H  -0.779993 2.312428 1.312159
H  -1.619812 3.281818 0.094731
H  0.771519 0.36603 0.007198
H  -0.194156 4.287392 -1.427606
H  1.836259 4.268835 -2.835499
H  3.337785 2.305714 -2.827121
H  3.268199 -2.40793 -1.467618
H  3.470497 1.129501 0.953239
H  3.980821 -3.765567 0.4670
H  4.158549 -0.23202 2.875773
H  4.416606 -2.684791 2.65469
elementType: O C H
totalener: -1117.85067864 hartree
nucrepener: 2348.21257444 hartree
electener: -3466.06325307 hartree
oneelecener: -6185.67304452 hartree
twoeener: 2719.60979144 hartree
cpcmener: -0.03029760 hartree
kineticenergy: 1112.79593942 hartree
xcener: -110.228982008984 hartree
chargesum: 0.0000000
charge: -0.264643 -0.514919 -0.341219 0.141963 -0.034209 -0.115498 -0.270368 -0.275164 -0.271123 0.422718 -0.024938 -0.225732 -0.279428 0.069366 -0.030577 -0.186868 -0.185963 0.270034 -0.126161 -0.241085 0.285909 -0.237222 -0.184070 -0.127930 -0.164636 -0.179259 0.112914 0.093023 0.093900 0.097154 0.087988 0.097125 0.076148 0.104724 0.130618 0.072982 0.119064 0.102477 0.109230 0.095075 0.096594 0.124784 0.109036 0.132686 0.145425 0.161017 0.148521 0.145380 0.155121 0.159223 0.161369 0.159444
qa: -0.2646 -0.5149 -0.3412 0.1420 -0.0342 -0.1155 -0.2704 -0.2752 -0.2711 0.4227 -0.0249 -0.2257 -0.2794 0.0694 -0.0306 -0.1869 -0.1860 0.2700 -0.1262 -0.2411 0.2859 -0.2372 -0.1841 -0.1279 -0.1646 -0.1793 0.1129 0.0930 0.0939 0.0972 0.0880 0.0971 0.0761 0.1047 0.1306 0.0730 0.1191 0.1025 0.1092 0.0951 0.0966 0.1248 0.1090 0.1327 0.1454 0.1610 0.1485 0.1454 0.1551 0.1592 0.1614 0.1594
va: 2.1221 1.9777 2.0636 3.7517 3.8099 3.8611 3.9033 3.9034 3.7871 4.0958 3.7186 3.9117 3.9461 3.8033 3.7706 3.8931 3.9115 3.7105 3.9002 3.9891 3.6626 3.9540 3.8753 3.8584 3.8540 3.8544 1.0037 1.0301 1.0023 1.0011 1.0049 1.0006 1.0067 1.0012 0.9943 1.0110 0.9950 0.9908 0.9952 1.0043 1.0043 0.9945 1.0090 0.9916 1.0005 0.9881 1.0059 1.0089 0.9983 0.9894 0.9907 0.9907
dispcorr: -0.029511659 hartree
energy: -1117.880190294760
dipole: -12.54934 13.17127 0.62193 -12.94122 12.22227 -0.71895 4.67905 -4.82044 -0.14138
magnitude: 0.96108 au
magnitude: 2.44288 debye
