program: Orca
programVersion: 5.0.2
elementType: O O O C C C C C C C C C C C C C C C C C C C C C C C H H H H H H H H H H H H H H H H H H H H H H H H H H
charge: 0
multiplicity: 1
keywords: wb97x-d3
keywords: def2-TZVPP
keywords: def2/J RIJCOSX
keywords: DEFGRID2
keywords: scfconv7
keywords: smallprint printgap noloewdin
keywords: NOSOSCF
formula: C23H26O3
InChI: InChI=1/C23H26O3/c1-16(2)13-20-21(23(20,3)4)22(24)25-15-17-9-8-12-19(14-17)26-18-10-6-5-7-11-18/h5-14,20-21H,15H2,1-4H3
52 atoms
O  -1.112526 0.828201 -1.541466
O  -1.687089 1.546555 0.492159
O  3.995168 0.655132 -0.627562
C  -1.724059 -1.524113 1.140387
C  -3.145694 -1.184174 0.823089
C  -2.031776 -0.751472 -0.132253
C  -1.300894 -2.956937 0.923576
C  -1.000184 -0.87526 2.293486
C  -3.953691 -0.23833 1.614083
C  -1.615311 0.647358 -0.315044
C  -5.266876 -0.341548 1.853402
C  -5.968829 0.68775 2.688639
C  -6.163073 -1.430435 1.346735
C  -0.542162 2.107409 -1.839679
C  0.754509 2.316999 -1.109928
C  1.757829 1.35745 -1.214937
C  0.962427 3.45568 -0.343157
C  2.95424 1.539614 -0.537841
C  2.1737 3.637016 0.311162
C  3.17087 2.679469 0.227268
C  3.748888 -0.679681 -0.844953
C  2.857911 -1.394447 -0.053585
C  4.474699 -1.308498 -1.844874
C  2.701707 -2.754816 -0.274779
C  4.314089 -2.672202 -2.049454
C  3.426496 -3.399353 -1.269444
H  -3.708294 -2.01045 0.403916
H  -1.969259 -1.337616 -1.041308
H  -1.821665 -3.412969 0.080942
H  -1.513006 -3.555564 1.81153
H  -0.228397 -3.02154 0.728475
H  -1.152252 -1.470811 3.195319
H  -1.321561 0.137848 2.516273
H  0.073888 -0.847304 2.097792
H  -3.441136 0.608223 2.053359
H  -5.299255 1.48328 3.014869
H  -6.414579 0.234733 3.577893
H  -6.791333 1.14552 2.132656
H  -6.710814 -1.886593 2.174106
H  -5.64453 -2.226545 0.818951
H  -6.917404 -1.021737 0.671193
H  -1.248681 2.910772 -1.624488
H  -0.379834 2.08744 -2.916936
H  1.602305 0.478716 -1.829419
H  0.179676 4.198454 -0.255295
H  2.337669 4.523815 0.908971
H  4.111132 2.811934 0.747188
H  2.292914 -0.902516 0.729237
H  5.164883 -0.736992 -2.452339
H  2.010816 -3.315339 0.341337
H  4.884074 -3.163259 -2.827118
H  3.300693 -4.46126 -1.432719
elementType: O C H
totalener: -1117.85370026 hartree
nucrepener: 2278.02797960 hartree
electener: -3395.88167985 hartree
oneelecener: -6045.99188237 hartree
twoeener: 2650.11020251 hartree
cpcmener: -0.03162838 hartree
kineticenergy: 1112.80306943 hartree
xcener: -110.229710434367 hartree
chargesum: 0.0000000
charge: -0.298454 -0.495351 -0.341669 0.102080 0.023696 -0.077997 -0.256502 -0.280084 -0.296957 0.406923 -0.060950 -0.218505 -0.255905 0.100360 0.018243 -0.232740 -0.228024 0.284489 -0.112737 -0.261594 0.273101 -0.203809 -0.231652 -0.162947 -0.132448 -0.182667 0.121779 0.096936 0.089709 0.096737 0.081236 0.101645 0.095792 0.095106 0.120188 0.088584 0.093729 0.092463 0.094705 0.089914 0.099035 0.115487 0.126071 0.139028 0.145983 0.160826 0.149145 0.177034 0.148283 0.180599 0.161267 0.160821
qa: -0.2985 -0.4954 -0.3417 0.1021 0.0237 -0.0780 -0.2565 -0.2801 -0.2970 0.4069 -0.0610 -0.2185 -0.2559 0.1004 0.0182 -0.2327 -0.2280 0.2845 -0.1127 -0.2616 0.2731 -0.2038 -0.2317 -0.1629 -0.1324 -0.1827 0.1218 0.0969 0.0897 0.0967 0.0812 0.1016 0.0958 0.0951 0.1202 0.0886 0.0937 0.0925 0.0947 0.0899 0.0990 0.1155 0.1261 0.1390 0.1460 0.1608 0.1491 0.1770 0.1483 0.1806 0.1613 0.1608
va: 2.1094 1.9946 2.0635 3.7044 3.7462 3.8312 3.9098 3.9013 3.8501 4.0947 3.7924 3.9209 3.9383 3.7999 3.6350 3.9211 3.9492 3.7010 3.8940 4.0067 3.7034 3.9231 3.9990 3.8877 3.8838 3.9118 1.0009 1.0300 1.0064 1.0029 1.0114 1.0008 1.0147 1.0025 1.0242 1.0090 0.9965 0.9960 0.9971 1.0139 0.9963 1.0090 0.9936 1.0175 1.0042 0.9879 1.0062 0.9818 1.0065 0.9777 0.9880 0.9906
dispcorr: -0.025504758 hartree
energy: -1117.879205014683
dipole: -26.63094 26.12217 -0.50877 -11.81904 10.59182 -1.22722 12.50463 -13.10754 -0.60291
magnitude: 1.45891 au
magnitude: 3.70825 debye
