program: Orca
programVersion: 5.0.2
elementType: O O O C C C C C C C C C C C C C C C C C C C C C C C H H H H H H H H H H H H H H H H H H H H H H H H H H
charge: 0
multiplicity: 1
keywords: wb97x-d3
keywords: def2-TZVPP
keywords: def2/J RIJCOSX
keywords: DEFGRID2
keywords: scfconv7
keywords: smallprint printgap noloewdin
keywords: NOSOSCF
formula: C23H26O3
InChI: InChI=1/C23H26O3/c1-16(2)13-20-21(23(20,3)4)22(24)25-15-17-9-8-12-19(14-17)26-18-10-6-5-7-11-18/h5-14,20-21H,15H2,1-4H3
52 atoms
O  -2.399952 1.836425 -1.426961
O  -1.76914 -0.300975 -1.519457
O  3.267545 0.4140 -1.296233
C  -4.450305 -1.018684 -0.17952
C  -3.606721 -0.533803 0.948031
C  -3.756398 0.317476 -0.326541
C  -5.946944 -0.918233 0.008484
C  -4.055021 -2.220932 -1.001849
C  -2.303123 -1.134607 1.316192
C  -2.559249 0.536569 -1.148764
C  -1.433021 -0.553015 2.14697
C  -0.146226 -1.215481 2.528718
C  -1.687503 0.787087 2.774299
C  -1.184797 2.214228 -2.082932
C  0.010462 2.028974 -1.189385
C  1.100091 1.284689 -1.624178
C  0.025487 2.585388 0.086035
C  2.197926 1.113709 -0.794712
C  1.12486 2.397298 0.910856
C  2.220194 1.663797 0.479618
C  3.87022 -0.536002 -0.508682
C  5.251325 -0.642586 -0.587733
C  3.135515 -1.396624 0.298514
C  5.902568 -1.621816 0.149396
C  3.801663 -2.36337 1.037912
C  5.183927 -2.480459 0.96999
H  -4.15525 -0.104299 1.781251
H  -4.387037 1.192343 -0.222006
H  -6.229722 -0.027094 0.570101
H  -6.322112 -1.787083 0.552409
H  -6.459377 -0.882556 -0.954646
H  -4.419317 -2.11954 -2.02546
H  -4.520129 -3.112559 -0.577901
H  -2.985963 -2.40224 -1.047845
H  -2.05992 -2.110336 0.908111
H  -0.073371 -1.334066 3.613093
H  0.707753 -0.601209 2.229924
H  -0.034665 -2.199077 2.072723
H  -2.226212 0.677796 3.719916
H  -2.278922 1.445642 2.13818
H  -0.752416 1.298442 3.005473
H  -1.323844 3.266942 -2.326468
H  -1.064278 1.669387 -3.020966
H  1.094291 0.829871 -2.607698
H  -0.817891 3.1649 0.440175
H  1.135835 2.832643 1.901299
H  3.076919 1.529094 1.127479
H  5.809562 0.032983 -1.223443
H  2.05624 -1.323324 0.349755
H  6.979753 -1.704273 0.086712
H  3.230414 -3.032396 1.668404
H  5.695965 -3.236761 1.549632
elementType: O C H
totalener: -1117.85205340 hartree
nucrepener: 2327.51400506 hartree
electener: -3445.36605846 hartree
oneelecener: -6145.52105210 hartree
twoeener: 2700.15499364 hartree
cpcmener: -0.03194267 hartree
kineticenergy: 1112.81153938 hartree
xcener: -110.230922926650 hartree
chargesum: 0.0000000
charge: -0.297672 -0.491629 -0.346478 0.139457 -0.037273 -0.083227 -0.266022 -0.293361 -0.261753 0.387205 -0.015947 -0.226728 -0.312375 0.096176 0.042972 -0.245296 -0.243876 0.280032 -0.153963 -0.202328 0.259676 -0.229309 -0.183036 -0.137564 -0.173384 -0.175110 0.114882 0.093971 0.087936 0.095866 0.095572 0.103933 0.097557 0.088556 0.130091 0.110427 0.078145 0.094458 0.124152 0.097073 0.100593 0.126142 0.116189 0.133227 0.146103 0.164270 0.158841 0.147656 0.183777 0.160901 0.158812 0.161685
qa: -0.2977 -0.4916 -0.3465 0.1395 -0.0373 -0.0832 -0.2660 -0.2934 -0.2618 0.3872 -0.0159 -0.2267 -0.3124 0.0962 0.0430 -0.2453 -0.2439 0.2800 -0.1540 -0.2023 0.2597 -0.2293 -0.1830 -0.1376 -0.1734 -0.1751 0.1149 0.0940 0.0879 0.0959 0.0956 0.1039 0.0976 0.0886 0.1301 0.1104 0.0781 0.0945 0.1242 0.0971 0.1006 0.1261 0.1162 0.1332 0.1461 0.1643 0.1588 0.1477 0.1838 0.1609 0.1588 0.1617
va: 2.1068 1.9929 2.0533 3.7742 3.7988 3.8362 3.8973 3.8887 3.8127 4.1102 3.6555 3.9191 3.9532 3.7959 3.5913 4.0581 3.8931 3.6979 3.8385 3.8917 3.7183 3.9882 3.8785 3.8911 3.9104 3.8870 1.0023 1.0308 1.0043 1.0018 1.0022 0.9993 0.9996 1.0203 1.0013 0.9976 0.9924 1.0047 0.9976 0.9976 1.0003 0.9929 1.0086 1.0194 1.0091 0.9887 0.9961 1.0071 0.9706 0.9881 0.9940 0.9889
dispcorr: -0.028777973 hartree
energy: -1117.880831370903
dipole: -18.90334 18.16420 -0.73914 -7.69186 8.36023 0.66837 13.04100 -11.80326 1.23774
magnitude: 1.58904 au
magnitude: 4.03901 debye
