program: Orca
programVersion: 5.0.2
elementType: O O O C C C C C C C C C C C C C C C C C C C C C C C H H H H H H H H H H H H H H H H H H H H H H H H H H
charge: 0
multiplicity: 1
keywords: wb97x-d3
keywords: def2-TZVPP
keywords: def2/J RIJCOSX
keywords: DEFGRID2
keywords: scfconv7
keywords: smallprint printgap noloewdin
keywords: NOSOSCF
formula: C23H26O3
InChI: InChI=1/C23H26O3/c1-16(2)13-20-21(23(20,3)4)22(24)25-15-17-9-8-12-19(14-17)26-18-10-6-5-7-11-18/h5-14,20-21H,15H2,1-4H3
52 atoms
O  -2.441872 1.826126 -1.387099
O  -1.823293 -0.314697 -1.507847
O  3.20487 0.370014 -1.414184
C  -4.462639 -1.022733 -0.067659
C  -3.584505 -0.5228 1.027733
C  -3.770926 0.310128 -0.255035
C  -5.953253 -0.912242 0.158971
C  -4.095961 -2.242549 -0.877543
C  -2.276745 -1.130914 1.366491
C  -2.597935 0.526094 -1.111604
C  -1.380404 -0.568201 2.183042
C  -0.099405 -1.259071 2.535331
C  -1.585463 0.771096 2.825619
C  -1.249671 2.20765 -2.083773
C  -0.026021 2.029059 -1.229302
C  1.039475 1.262795 -1.685153
C  0.039678 2.613804 0.031869
C  2.164211 1.097389 -0.891418
C  1.166967 2.433963 0.819944
C  2.238518 1.677913 0.367481
C  3.844044 -0.539392 -0.606015
C  3.136986 -1.401955 0.223036
C  5.227039 -0.602368 -0.68328
C  3.833785 -2.326486 0.987408
C  5.910205 -1.539237 0.080188
C  5.219462 -2.399209 0.922549
H  -4.108314 -0.078766 1.868835
H  -4.400591 1.184361 -0.139343
H  -6.212298 -0.034093 0.751953
H  -6.325646 -1.791847 0.68751
H  -6.487942 -0.844002 -0.790306
H  -4.528198 -2.179323 -1.877582
H  -4.515097 -3.128845 -0.397413
H  -3.028831 -2.406311 -0.988944
H  -2.050854 -2.107474 0.950268
H  0.761817 -0.665061 2.216681
H  -0.021331 -2.245178 2.077781
H  -0.004631 -1.379992 3.617823
H  -0.6451 1.320904 2.88848
H  -1.946246 0.656335 3.851832
H  -2.301648 1.395346 2.292924
H  -1.401391 3.259599 -2.323378
H  -1.158486 1.662327 -3.024864
H  0.992535 0.786783 -2.65738
H  -0.783985 3.210449 0.403634
H  1.219189 2.894064 1.797861
H  3.11611 1.552116 0.988594
H  2.055908 -1.362269 0.273599
H  5.763991 0.074386 -1.335615
H  3.284808 -2.997278 1.635451
H  6.989414 -1.587501 0.0195
H  5.755584 -3.122994 1.52156
elementType: O C H
totalener: -1117.85238474 hartree
nucrepener: 2324.48010056 hartree
electener: -3442.33248529 hartree
oneelecener: -6139.48226014 hartree
twoeener: 2697.14977484 hartree
cpcmener: -0.03202591 hartree
kineticenergy: 1112.80642054 hartree
xcener: -110.229414954172 hartree
chargesum: 0.0000000
charge: -0.296269 -0.493129 -0.347300 0.145257 -0.033532 -0.094937 -0.264230 -0.295109 -0.262368 0.395198 -0.021652 -0.228190 -0.301879 0.094792 0.042522 -0.242578 -0.249601 0.273814 -0.153146 -0.196631 0.251029 -0.178597 -0.224164 -0.171867 -0.139660 -0.172544 0.114024 0.094007 0.087817 0.095092 0.096030 0.102901 0.098888 0.088917 0.130001 0.078543 0.094970 0.107860 0.097888 0.122064 0.096287 0.126598 0.116776 0.133458 0.145851 0.165178 0.158480 0.182906 0.148277 0.159218 0.160983 0.161760
qa: -0.2963 -0.4931 -0.3473 0.1453 -0.0335 -0.0949 -0.2642 -0.2951 -0.2624 0.3952 -0.0217 -0.2282 -0.3019 0.0948 0.0425 -0.2426 -0.2496 0.2738 -0.1531 -0.1966 0.2510 -0.1786 -0.2242 -0.1719 -0.1397 -0.1725 0.1140 0.0940 0.0878 0.0951 0.0960 0.1029 0.0989 0.0889 0.1300 0.0785 0.0950 0.1079 0.0979 0.1221 0.0963 0.1266 0.1168 0.1335 0.1459 0.1652 0.1585 0.1829 0.1483 0.1592 0.1610 0.1618
va: 2.1078 1.9925 2.0505 3.7644 3.7924 3.8464 3.8958 3.8882 3.8224 4.1079 3.6681 3.9230 3.9487 3.7953 3.5886 4.0546 3.8937 3.7082 3.8414 3.8839 3.7216 3.8816 3.9878 3.9076 3.8909 3.8860 1.0026 1.0310 1.0043 1.0022 1.0023 0.9995 0.9991 1.0205 1.0012 0.9934 1.0047 0.9981 0.9989 0.9976 1.0008 0.9929 1.0082 1.0201 1.0094 0.9879 0.9965 0.9710 1.0065 0.9936 0.9882 0.9889
dispcorr: -0.028528235 hartree
energy: -1117.880912972314
dipole: -18.46698 17.81146 -0.65552 -7.66968 8.35682 0.68714 13.77992 -12.49179 1.28813
magnitude: 1.60035 au
magnitude: 4.06778 debye
