program: Orca
programVersion: 5.0.2
elementType: O O O C C C C C C C C C C C C C C C C C C C C C C C H H H H H H H H H H H H H H H H H H H H H H H H H H
charge: 0
multiplicity: 1
keywords: wb97x-d3
keywords: def2-TZVPP
keywords: def2/J RIJCOSX
keywords: DEFGRID2
keywords: scfconv7
keywords: smallprint printgap noloewdin
keywords: NOSOSCF
formula: C23H26O3
InChI: InChI=1/C23H26O3/c1-16(2)13-20-21(23(20,3)4)22(24)25-15-17-9-8-12-19(14-17)26-18-10-6-5-7-11-18/h5-14,20-21H,15H2,1-4H3
52 atoms
O  -1.634443 0.82055 -0.940222
O  -3.609189 1.191663 -1.901832
O  3.467972 0.599292 -0.150454
C  -2.754181 -1.986331 -0.338682
C  -2.8090 -1.159195 0.898926
C  -3.414355 -0.615612 -0.395313
C  -3.711342 -3.149744 -0.445539
C  -1.436008 -2.250737 -1.023466
C  -1.58459 -0.622614 1.545672
C  -2.906943 0.540993 -1.154055
C  -1.524255 0.490067 2.279224
C  -0.253175 0.924108 2.941924
C  -2.703061 1.389541 2.492465
C  -1.036431 1.953804 -1.583706
C  0.241602 2.215579 -0.84483
C  1.257704 1.263767 -0.872603
C  0.40066 3.3770 -0.100425
C  2.413846 1.473917 -0.136652
C  1.574145 3.587732 0.61212
C  2.579347 2.63543 0.60858
C  3.257106 -0.754186 -0.236732
C  2.238939 -1.391981 0.460326
C  4.153586 -1.482874 -1.005228
C  2.118238 -2.771289 0.372851
C  4.029817 -2.863698 -1.071994
C  3.009088 -3.513527 -0.39154
H  -3.589746 -1.443225 1.600604
H  -4.49689 -0.652034 -0.436465
H  -3.932081 -3.383853 -1.488624
H  -4.65635 -2.943612 0.058063
H  -3.279077 -4.042568 0.010722
H  -1.004272 -3.174189 -0.631442
H  -0.694109 -1.467981 -0.887939
H  -1.58177 -2.389759 -2.0960
H  -0.682855 -1.219801 1.4402
H  -0.391424 1.047271 4.019096
H  0.070595 1.896245 2.561201
H  0.558833 0.213925 2.788565
H  -3.138036 1.231306 3.485289
H  -3.496042 1.235173 1.759569
H  -2.403693 2.440801 2.450416
H  -1.694863 2.821637 -1.532176
H  -0.856797 1.720513 -2.635396
H  1.139785 0.368149 -1.471766
H  -0.391576 4.114452 -0.07404
H  1.700694 4.493704 1.189649
H  3.48988 2.790443 1.172889
H  1.546687 -0.826888 1.071343
H  4.945337 -0.973954 -1.540264
H  1.323547 -3.265961 0.915917
H  4.732968 -3.430267 -1.668304
H  2.911817 -4.589142 -0.451588
elementType: O C H
totalener: -1117.84985740 hartree
nucrepener: 2390.80040105 hartree
electener: -3508.65025844 hartree
oneelecener: -6270.60382053 hartree
twoeener: 2761.95356208 hartree
cpcmener: -0.03240924 hartree
kineticenergy: 1112.80947685 hartree
xcener: -110.231672253675 hartree
chargesum: 0.0000000
charge: -0.253665 -0.514254 -0.340448 0.140904 -0.003185 -0.161977 -0.270927 -0.276962 -0.237645 0.441163 -0.035659 -0.267131 -0.277077 0.067161 -0.016001 -0.228846 -0.208400 0.306444 -0.116985 -0.249681 0.269864 -0.144899 -0.229313 -0.206538 -0.143833 -0.156478 0.116004 0.096484 0.096159 0.088235 0.093514 0.100251 0.055325 0.108360 0.132644 0.115658 0.089032 0.104749 0.114257 0.096383 0.094124 0.103270 0.129567 0.152861 0.145021 0.159894 0.146665 0.143399 0.147479 0.162781 0.161003 0.161247
qa: -0.2537 -0.5143 -0.3404 0.1409 -0.0032 -0.1620 -0.2709 -0.2770 -0.2376 0.4412 -0.0357 -0.2671 -0.2771 0.0672 -0.0160 -0.2288 -0.2084 0.3064 -0.1170 -0.2497 0.2699 -0.1449 -0.2293 -0.2065 -0.1438 -0.1565 0.1160 0.0965 0.0962 0.0882 0.0935 0.1003 0.0553 0.1084 0.1326 0.1157 0.0890 0.1047 0.1143 0.0964 0.0941 0.1033 0.1296 0.1529 0.1450 0.1599 0.1467 0.1434 0.1475 0.1628 0.1610 0.1612
va: 2.1130 1.9842 2.0761 3.7214 3.7662 3.8959 3.9071 3.9240 3.7876 4.0812 3.6637 3.9318 3.9455 3.8265 3.7183 3.8910 3.8914 3.6627 3.8630 3.9927 3.7126 3.8175 3.9769 3.8936 3.9010 3.8784 1.0046 1.0288 1.0016 1.0051 1.0017 0.9974 1.0028 1.0052 0.9827 0.9999 0.9958 0.9931 0.9971 1.0035 0.9995 1.0117 0.9942 1.0010 1.0014 0.9884 1.0070 0.9896 1.0074 0.9907 0.9877 0.9891
dispcorr: -0.031554377 hartree
energy: -1117.881411773460
dipole: -12.71290 13.24608 0.53318 -8.78908 8.06441 -0.72468 9.44714 -8.54459 0.90255
magnitude: 1.27438 au
magnitude: 3.23921 debye
