program: Gaussian 09
title: 000068181
version: EM64L-G09RevD.01
frameworkgroup: C1[X(C2H3Br3O2)]
method: RPBEPBE
basis: SDD
operation: Freq
keyword: #p
keyword: freq=noraman
keyword: PBEPBE/SDD
title: #p freq=noraman PBEPBE/SDD
converged: NO YES NO NO
title: Mulliken charges:
elementType: Br Br Br O O C C H H H
charge: 0.166831 0.138496 0.160889 -0.380350 -0.392326 -0.010635 -0.711059 0.280107 0.369391 0.378656
chargesum: 0.00000
title: Mulliken charges with hydrogens summed into heavy atoms:
elementType: Br Br Br O O C C
charge: 0.166831 0.138496 0.160889 -0.010959 -0.013670 0.269472 -0.711059
polarizability: 8.86679825e+01 -7.37924555e-01 8.36490270e+01 6.03755722e-02 -6.43916579e+00 6.41804326e+01
1716.lowfreq: -5.9495 -5.7658 -0.0004 -0.0003 0.0003 8.2188 86.7613 120.8041 130.0439
frequency: 86.7533 120.8022 130.0428 171.2907 175.3478 196.4533 236.4172 266.8982 322.5613 416.6915 496.7454 542.9559 681.0923 710.3478 908.2656 973.4787 990.1771 1202.5668 1233.3203 1345.9508 1372.3802 3046.6996 3500.8753 3576.6795
redmass: 7.1829 15.9803 15.6509 16.6889 10.4929 20.9011 1.1505 11.2879 8.2431 1.6519 3.2817 2.7019 10.4499 6.2937 5.0181 4.0607 7.4318 1.1573 1.3271 1.3274 1.1865 1.0856 1.0647 1.0661
irintensity: 0.5818 0.1151 0.1513 1.6238 2.1271 0.8456 120.6088 3.7745 12.6984 50.2930 97.9562 204.3892 207.5474 107.5712 39.2689 129.1753 121.1623 41.9408 26.2089 9.2453 42.6218 10.0522 13.7473 25.9895
temp: 298.150 k
press: 1.00000 atm
elementType: 35 35 35 8 8 6 6 1 1 1
symmnumber: 1
zpe: 135804.8 jmol-1
zpe.correction: 0.051725 hartree
zpe.thermalcorrener: 0.060952 hartree
zpe.thermalcorrenthalpy: 0.061896 hartree
zpe.thermalcorrgfe: 0.014808 hartree
zpe.sumelectzpe: -268.240200 hartree
zpe.sumelectthermal: -268.230974 hartree
zpe.sumelectthermalent: -268.230029 hartree
zpe.sumelectthermalfe: -268.277117 hartree
dipole: 0.0161 0.8078 1.7265
dipole: 1.9062
quadrupole: -70.6030 -65.3672 -63.4105
quadrupole: -2.3188 4.2070 2.2781
quadrupole: -4.1428 1.0930 3.0497 -2.3188 4.2070 2.2781
hfenergy: -268.2919251 hartree
pointgroup: C01 [X(C2H3Br3O2)]
dipole: 0.7167297 -0.0551769 0.2137021 debye
dipolederiv: -0.1956099 -0.3107695 0.1206441 -0.2741734 -0.6379242 0.2329317 0.1045688 0.2491192 -0.1678711 -0.1192514 -0.0250788 0.0935523 -0.0383621 -0.0789469 0.041912 0.0928752 -0.0019553 -0.8432322 -0.179575 0.2775925 0.1326494 0.258152 -0.5853851 -0.2343749 0.1115979 -0.2309799 -0.1859933 -0.873418 -0.2541142 0.0193258 -0.0619794 -0.7797585 0.1307701 0.0268643 0.154505 -0.2011574 -0.6312672 0.3390638 0.1710664 0.2801239 -0.8086931 0.1060298 0.1753876 -0.0055265 -0.3141226 1.065477 -0.0571892 0.0295073 -0.1170779 0.8432731 -0.0948609 -0.0007411 -0.0559744 0.137882 0.2823918 0.0215975 -0.4030037 -0.0134526 1.4066352 -0.0106139 -0.4622137 -0.0108346 1.3029284 -0.0004168 0.0092112 -0.0503998 0.01772 0.0105375 -0.018923 0.0603415 -0.0120081 -0.0702287 0.4811672 0.0146006 -0.0098016 -0.0017719 0.3102393 -0.0725803 0.0196229 -0.0277963 0.0789062 0.1705023 -0.0149139 -0.1035403 -0.0491785 0.3200226 -0.0802906 -0.1283034 -0.0585494 0.2628888 unknown
polarizability: 66.4968397|1.609327|88.2773721|-9.0294236|-0.578576|81.7232302 unknown
InChI: InChI=1S/C2H3Br3O2/c3-2(4,5)1(6)7/h1,6-7H
charge 0 multiplicity 1
10 atoms
Br -1.54819 -1.676386 0.63344
Br -0.548048 0.013746 -2.015544
Br -1.600115 1.598027 0.671574
O  1.567869 1.211722 0.213982
O  1.504929 -1.178169 0.100589
C  0.849366 0.017721 0.578802
C  -0.607389 -0.019476 0.004531
H  0.78053 0.061072 1.681766
H  1.64094 1.256963 -0.777992
H  2.390308 -1.25432 0.538951
