program: Orca
programVersion: 5.0.2
elementType: O O O C C C C C C C C C C C C C C C C C C C C C C C H H H H H H H H H H H H H H H H H H H H H H H H H H
charge: 0
multiplicity: 1
keywords: wb97x-d3
keywords: def2-TZVPP
keywords: def2/J RIJCOSX
keywords: DEFGRID2
keywords: scfconv7
keywords: smallprint printgap noloewdin
keywords: NOSOSCF
formula: C23H26O3
InChI: InChI=1/C23H26O3/c1-16(2)13-20-21(23(20,3)4)22(24)25-15-17-9-8-12-19(14-17)26-18-10-6-5-7-11-18/h5-14,20-21H,15H2,1-4H3
52 atoms
O  -2.049811 1.255069 -0.674356
O  -1.766765 1.804922 1.464883
O  2.980812 0.919687 -0.384662
C  -3.360234 -1.326831 0.25407
C  -1.902994 -1.670813 0.249286
C  -2.393321 -0.4124 0.97987
C  -4.24808 -2.141135 1.166284
C  -4.068394 -0.917806 -1.014616
C  -1.066039 -1.629209 -0.964484
C  -2.043009 0.974179 0.625646
C  -0.145494 -2.53526 -1.316122
C  0.63706 -2.366274 -2.583541
C  0.183489 -3.780678 -0.551654
C  -1.608325 2.547664 -1.084552
C  -0.146561 2.776659 -0.813395
C  0.747836 1.715547 -0.7688
C  0.318263 4.07365 -0.618723
C  2.079972 1.953665 -0.464674
C  1.663187 4.301708 -0.370539
C  2.553108 3.241375 -0.271612
C  2.713927 -0.162175 0.41437
C  3.451129 -1.310912 0.148262
C  1.804805 -0.137624 1.466398
C  3.282778 -2.433446 0.943611
C  1.639423 -1.275893 2.245251
C  2.373985 -2.425215 1.994072
H  -1.628833 -2.446075 0.956251
H  -2.404571 -0.520122 2.058195
H  -4.571385 -3.055944 0.665943
H  -5.142677 -1.579588 1.442964
H  -3.736363 -2.427476 2.085848
H  -4.872733 -0.212841 -0.797958
H  -4.524041 -1.801721 -1.464585
H  -3.426552 -0.471908 -1.767933
H  -1.224694 -0.804555 -1.647918
H  0.537703 -3.243107 -3.228683
H  1.703964 -2.261887 -2.366582
H  0.322519 -1.490797 -3.151431
H  -0.200754 -4.657045 -1.081499
H  -0.222639 -3.803031 0.457548
H  1.264206 -3.915859 -0.479534
H  -2.211836 3.328738 -0.617748
H  -1.80851 2.576206 -2.155682
H  0.414625 0.698189 -0.939222
H  -0.375218 4.904968 -0.65079
H  2.019782 5.312224 -0.221615
H  3.597387 3.410711 -0.042985
H  4.156461 -1.319124 -0.673309
H  1.225722 0.747938 1.692387
H  3.862028 -3.322932 0.73308
H  0.928354 -1.252859 3.060838
H  2.238842 -3.305497 2.607871
elementType: O C H
totalener: -1117.85099725 hartree
nucrepener: 2416.64402211 hartree
electener: -3534.49501936 hartree
oneelecener: -6323.22363861 hartree
twoeener: 2788.72861925 hartree
cpcmener: -0.03198323 hartree
kineticenergy: 1112.80144887 hartree
xcener: -110.235661410412 hartree
chargesum: 0.0000000
charge: -0.279747 -0.495830 -0.338292 0.118134 0.037187 -0.108226 -0.271492 -0.275307 -0.294890 0.408873 -0.065852 -0.220134 -0.301857 0.068488 0.013532 -0.191847 -0.214207 0.252616 -0.126030 -0.232153 0.352793 -0.288732 -0.211275 -0.118668 -0.163430 -0.193093 0.120486 0.097932 0.095730 0.095305 0.088744 0.105005 0.095707 0.092921 0.133375 0.104425 0.091328 0.090506 0.120007 0.094283 0.097431 0.124077 0.119965 0.137500 0.145021 0.161403 0.147861 0.145692 0.151479 0.162262 0.161847 0.159148
qa: -0.2797 -0.4958 -0.3383 0.1181 0.0372 -0.1082 -0.2715 -0.2753 -0.2949 0.4089 -0.0659 -0.2201 -0.3019 0.0685 0.0135 -0.1918 -0.2142 0.2526 -0.1260 -0.2322 0.3528 -0.2887 -0.2113 -0.1187 -0.1634 -0.1931 0.1205 0.0979 0.0957 0.0953 0.0887 0.1050 0.0957 0.0929 0.1334 0.1044 0.0913 0.0905 0.1200 0.0943 0.0974 0.1241 0.1200 0.1375 0.1450 0.1614 0.1479 0.1457 0.1515 0.1623 0.1618 0.1591
va: 2.1110 1.9913 2.0748 3.7569 3.6946 3.8442 3.9096 3.9009 3.7865 4.1028 3.6877 3.9057 3.9430 3.7948 3.6129 3.8834 3.9553 3.7327 3.8838 4.0020 3.6017 3.9340 3.8323 3.8069 3.8448 3.8423 0.9963 1.0263 1.0014 1.0014 1.0058 1.0006 1.0008 1.0084 1.0042 0.9975 0.9978 1.0081 0.9970 1.0088 0.9947 1.0063 0.9957 1.0153 0.9999 0.9875 1.0050 1.0098 1.0088 0.9871 0.9899 0.9905
dispcorr: -0.031559257 hartree
energy: -1117.882556511574
dipole: -13.36493 12.57254 -0.79239 -20.06804 19.08545 -0.98260 -4.96215 4.09021 -0.87194
magnitude: 1.53416 au
magnitude: 3.89953 debye
