program: Gaussian 09
title: 000068191
version: EM64L-G09RevD.01
frameworkgroup: C1[X(C10H13Cl)]
method: RPBEPBE
basis: SDD
operation: Freq
keyword: #p
keyword: freq=noraman
keyword: PBEPBE/SDD
title: #p freq=noraman PBEPBE/SDD
converged: YES YES NO NO
title: Mulliken charges:
elementType: Cl C C C C C C C C C C H H H H H H H H H H H H H
charge: -0.075731 0.136055 0.510066 -0.606432 -0.694356 -0.734514 -0.386429 -0.405391 -0.258199 -0.240905 -0.241415 0.258725 0.264356 0.235913 0.216068 0.210170 0.218859 0.241923 0.212827 0.216641 0.245968 0.223529 0.223743 0.228531
chargesum: 0.00000
title: Mulliken charges with hydrogens summed into heavy atoms:
elementType: Cl C C C C C C C C C C
charge: -0.075731 0.136055 0.510066 -0.083351 -0.032205 -0.060905 -0.169788 -0.159423 -0.034670 -0.017162 -0.012884
polarizability: 1.28886043e+02 1.37867207e+01 9.29758656e+01 2.23825783e+00 -8.15243466e+00 1.08018663e+02
1716.lowfreq: -13.3154 -6.5135 -0.0009 0.0012 0.0018 10.6078 39.4319 57.0179 141.6570
frequency: 39.4238 56.9997 141.6542 182.7017 220.5179 224.9710 281.8076 301.9312 317.0392 337.1298 404.7355 415.7840 434.8807 510.1310 553.5342 617.3644 680.2436 704.4821 706.7394 771.6686 837.7080 850.4442 892.0702 914.6949 936.9879 952.5582 975.7350 990.9615 994.9784 1006.0310 1027.7614 1083.1373 1091.8831 1128.6850 1158.2219 1174.2038 1200.2767 1216.5358 1272.7603 1288.3744 1324.2832 1375.6685 1379.4737 1397.6681 1433.7897 1441.5238 1465.8824 1469.4947 1481.6653 1488.6799 1495.4634 1591.8468 1613.8357 2980.2755 2986.0454 3044.4234 3073.7663 3078.3397 3088.9994 3095.9946 3113.1059 3125.7598 3128.2328 3138.7019 3156.2469 3169.3971
redmass: 3.9870 8.0158 2.8469 4.3247 1.0381 3.1761 3.4387 1.1199 2.4057 2.8681 2.7970 3.0957 3.3404 2.9141 3.0015 6.3989 5.6831 1.6566 5.0964 1.9506 2.2316 1.2619 1.8008 1.4471 1.5207 1.6328 1.3925 5.6499 1.3236 1.3174 2.5306 1.7818 1.4737 1.8211 1.8785 1.0552 1.1222 2.8393 1.2485 2.3740 1.3593 1.5445 3.0625 1.1921 2.0987 1.1236 1.0947 1.0530 1.1279 1.8215 1.0626 5.9470 6.0382 1.0348 1.0362 1.0566 1.0997 1.0990 1.0997 1.0996 1.0863 1.0875 1.1089 1.0931 1.0963 1.0976
irintensity: 0.3514 1.4481 1.5158 0.5976 0.0593 0.6009 0.3457 0.3359 1.8488 0.7812 0.0120 0.2813 0.8879 0.8847 27.1100 0.0700 17.4176 48.5734 13.0338 43.1635 8.0705 0.1757 15.9773 0.4857 3.6181 8.4012 0.1634 0.3583 0.1477 0.1374 12.1181 8.8069 4.5690 0.2478 2.7057 0.1238 0.6281 1.7164 15.4216 23.7448 0.2546 17.6194 3.4554 20.2998 8.4551 9.1917 1.8417 8.7147 5.6597 28.1862 16.6395 1.5625 7.0514 26.0350 25.8552 24.1777 5.4746 66.3615 22.1859 19.5235 15.4814 2.8929 17.2774 33.1961 36.1594 10.6931
temp: 298.150 k
press: 1.00000 atm
elementType: 17 6 6 6 6 6 6 6 6 6 6 1 1 1 1 1 1 1 1 1 1 1 1 1
symmnumber: 1
zpe: 526574.1 jmol-1
zpe.correction: 0.200561 hartree
zpe.thermalcorrener: 0.211631 hartree
zpe.thermalcorrenthalpy: 0.212575 hartree
zpe.thermalcorrgfe: 0.163293 hartree
zpe.sumelectzpe: -848.095850 hartree
zpe.sumelectthermal: -848.084780 hartree
zpe.sumelectthermalent: -848.083836 hartree
zpe.sumelectthermalfe: -848.133119 hartree
dipole: -0.2137 2.4006 -0.4090
dipole: 2.4445
quadrupole: -70.2801 -78.8658 -67.7181
quadrupole: 7.1932 -0.5696 -1.8359
quadrupole: 2.0079 -6.5778 4.5699 7.1932 -0.5696 -1.8359
hfenergy: -848.2964117 hartree
pointgroup: C01 [X(C10H13Cl1)]
dipole: -0.0545592 -0.8449209 -0.4561782 debye
dipolederiv: -0.1962549 0.0226144 -0.0001266 0.0765325 -0.5526345 -0.1435464 0.0240669 -0.1990095 -0.2700179 0.2040456 -0.0368828 -0.0593142 0.0382347 0.0202281 -0.0302575 -0.058952 -0.1336453 0.0280017 0.2949676 0.019723 0.0141411 0.0239288 -0.0894858 -0.000427 0.0456936 0.0194561 -0.0777447 0.1074205 -0.0360529 0.0041816 -0.1343068 0.6628545 0.2640377 -0.0131476 0.2909769 0.2685674 -0.0422976 0.0702778 0.0126835 0.035646 -0.0692174 -0.0675801 -0.0033938 0.0498401 0.0272021 -0.0190448 -0.0014913 0.0497127 -0.0089296 0.0004414 0.0209806 0.0278121 0.0067321 -0.071104 -0.1399195 -0.0054181 0.0667275 -0.0107392 -0.1458799 -0.0221565 0.1000396 -0.0235843 0.0353891 -0.1527006 0.0156747 -0.0579658 -0.0036581 -0.1188804 -0.0199449 -0.0885992 -0.0427915 0.0342807 -0.0029201 0.0318526 -0.0457158 0.0415778 -0.1391885 -0.0522435 -0.0757171 -0.0517003 0.0869353 0.0005819 0.0131217 0.0745974 0.0205045 -0.1366211 -0.0204248 0.0904705 -0.0223501 0.0964577 0.0653711 0.0431511 0.0056148 0.0398228 -0.1574695 -0.0127213 0.0126756 -0.0098629 -0.0910123 -0.156498 -0.0111794 -0.0422995 -0.0230356 -0.0080927 -0.0664943 -0.0140336 -0.0622226 0.0548549 0.1059483 -0.0337809 0.0826162 -0.0197396 -0.0276984 -0.0195047 0.0565503 0.0102034 -0.0983463 0.0680416 0.0931806 -0.0275368 0.0894997 -0.0988048 0.0133508 -0.0230685 0.0470427 0.0573656 0.08842 -0.0176548 0.0866975 -0.0157501 0.0738758 0.0781374 0.0727711 0.0223826 -0.1221227 -0.2082681 -0.0809202 -0.0393492 -0.0577897 0.0799385 -0.0169145 -0.0134318 -0.0183682 0.0847765 0.0605738 0.1100223 -0.044646 0.0930934 -0.0860278 0.0709555 -0.0188905 0.062356 0.04993 0.1118591 -0.0274644 -0.0426795 -0.0282647 0.0147113 -0.1156734 -0.0150318 -0.0832836 -0.0250084 -0.1952599 -0.0572194 0.0098477 -0.040479 0.0921409 0.0075715 -0.0604417 -0.0133907 0.0817675 0.0268109 0.0003827 -0.1186995 0.0017502 0.1276018 0.0134858 -0.1186869 0.0206777 -0.0559817 0.0790804 -0.0256505 0.0835519 -0.0228662 0.1187024 0.0328494 0.089197 0.0425758 -0.0405776 0.0210127 -0.0351723 0.0814869 -0.0394146 0.1390891 0.0525017 0.0990027 0.0539952 -0.0704287 0.0151712 -0.0044832 -0.0887014 -0.0064171 0.1489386 0.0228623 -0.1093902 0.0224865 -0.0752319 -0.1361412 -0.0466308 -0.0048245 -0.0492 0.1514785 0.0111564 -0.005495 0.0114838 0.0920477 unknown
polarizability: 132.1027057|7.9137583|86.5370623|1.6107355|1.1176002|111.2408031 unknown
InChI: InChI=1S/C10H13Cl/c1-10(2,8-11)9-6-4-3-5-7-9/h3-7H,8H2,1-2H3
charge 0 multiplicity 1
24 atoms
Cl -2.006711 2.250921 0.564759
C  -1.407332 -0.491291 -0.069619
C  0.11924 -0.240635 -0.011288
C  -2.144328 0.762976 -0.600579
C  -1.706607 -1.630354 -1.100409
C  -2.006472 -0.909751 1.295196
C  0.830431 0.083787 -1.198913
C  0.85471 -0.323658 1.196972
C  2.222033 0.31503 -1.181037
C  2.250501 -0.096287 1.220734
C  2.942218 0.224206 0.03275
H  -3.226523 0.579712 -0.696357
H  -1.728541 1.12108 -1.554462
H  -1.189186 -2.555128 -0.790254
H  -1.359412 -1.375921 -2.117637
H  -2.791768 -1.840015 -1.147909
H  -1.54436 -1.844972 1.658814
H  -1.870319 -0.124427 2.057852
H  -3.092428 -1.088379 1.188892
H  0.298983 0.159072 -2.155855
H  0.343187 -0.558618 2.13469
H  2.744047 0.565913 -2.111519
H  2.794216 -0.164266 2.170024
H  4.02302 0.403305 0.050355
