program: Orca
programVersion: 5.0.2
elementType: O O O C C C C C C C C C C C C C C C C C C C C C C C H H H H H H H H H H H H H H H H H H H H H H H H H H
charge: 0
multiplicity: 1
keywords: wb97x-d3
keywords: def2-TZVPP
keywords: def2/J RIJCOSX
keywords: DEFGRID2
keywords: scfconv7
keywords: smallprint printgap noloewdin
keywords: NOSOSCF
formula: C23H26O3
InChI: InChI=1/C23H26O3/c1-16(2)13-20-21(23(20,3)4)22(24)25-15-17-9-8-12-19(14-17)26-18-10-6-5-7-11-18/h5-14,20-21H,15H2,1-4H3
52 atoms
O  -2.28905 2.180961 -0.552263
O  -1.969729 0.29559 -1.704392
O  2.409003 1.033933 0.831131
C  -4.074825 -0.988675 0.199251
C  -2.847656 -0.982044 1.054645
C  -3.28375 0.294688 0.315402
C  -5.400878 -0.965634 0.924419
C  -4.136786 -1.779197 -1.084824
C  -1.614445 -1.717447 0.719249
C  -2.461567 0.86817 -0.759488
C  -0.706476 -2.160387 1.598661
C  0.477098 -2.959512 1.140853
C  -0.751478 -1.938094 3.079553
C  -1.490715 2.906248 -1.47717
C  -0.016668 2.623242 -1.366689
C  0.534443 1.916786 -0.304346
C  0.821707 3.121745 -2.359211
C  1.904972 1.717416 -0.25174
C  2.192686 2.929915 -2.283426
C  2.749564 2.225506 -1.226378
C  3.061034 -0.152805 0.63011
C  3.819489 -0.621858 1.697535
C  2.96581 -0.890086 -0.543898
C  4.483807 -1.832926 1.585535
C  3.644781 -2.098043 -0.641925
C  4.404339 -2.577345 0.414871
H  -3.048468 -0.900083 2.116479
H  -3.718484 1.045671 0.96423
H  -5.718515 -1.980236 1.171745
H  -6.177055 -0.516111 0.302053
H  -5.348294 -0.398001 1.854257
H  -4.817955 -1.304079 -1.79271
H  -4.532341 -2.773739 -0.871125
H  -3.182061 -1.912197 -1.583641
H  -1.440622 -1.949451 -0.325274
H  1.411433 -2.515622 1.494238
H  0.527603 -3.042273 0.055637
H  0.442542 -3.970781 1.555185
H  -1.640021 -1.416853 3.428032
H  0.118084 -1.357751 3.398903
H  -0.694846 -2.890913 3.611363
H  -1.680982 3.954092 -1.243418
H  -1.832798 2.73705 -2.500819
H  -0.077318 1.514752 0.494038
H  0.400403 3.666568 -3.195508
H  2.835456 3.329572 -3.056567
H  3.819432 2.070926 -1.166914
H  3.885632 -0.039482 2.607942
H  2.367657 -0.546366 -1.377297
H  5.072673 -2.192166 2.419451
H  3.568028 -2.66935 -1.557821
H  4.928527 -3.519539 0.328843
elementType: O C H
totalener: -1117.85396429 hartree
nucrepener: 2332.60335980 hartree
electener: -3450.45732409 hartree
oneelecener: -6155.74702473 hartree
twoeener: 2705.28970064 hartree
cpcmener: -0.03110660 hartree
kineticenergy: 1112.79153032 hartree
xcener: -110.230868257473 hartree
chargesum: -0.0000000
charge: -0.301510 -0.486391 -0.340122 0.116820 0.031050 -0.085078 -0.262830 -0.289130 -0.299078 0.390803 -0.051226 -0.223523 -0.255894 0.086636 0.018038 -0.226364 -0.209522 0.235964 -0.137407 -0.184116 0.316520 -0.259391 -0.188415 -0.119459 -0.184942 -0.187620 0.117688 0.096940 0.095466 0.094672 0.087619 0.103531 0.096946 0.094554 0.122087 0.065700 0.094499 0.111365 0.090868 0.097874 0.098097 0.131306 0.120435 0.130687 0.145820 0.162391 0.158979 0.145441 0.151696 0.160292 0.160955 0.160276
qa: -0.3015 -0.4864 -0.3401 0.1168 0.0310 -0.0851 -0.2628 -0.2891 -0.2991 0.3908 -0.0512 -0.2235 -0.2559 0.0866 0.0180 -0.2264 -0.2095 0.2360 -0.1374 -0.1841 0.3165 -0.2594 -0.1884 -0.1195 -0.1849 -0.1876 0.1177 0.0969 0.0955 0.0947 0.0876 0.1035 0.0969 0.0946 0.1221 0.0657 0.0945 0.1114 0.0909 0.0979 0.0981 0.1313 0.1204 0.1307 0.1458 0.1624 0.1590 0.1454 0.1517 0.1603 0.1610 0.1603
va: 2.1086 1.9987 2.0425 3.7421 3.7333 3.8250 3.9007 3.8942 3.8421 4.0853 3.7739 3.9246 3.9416 3.8037 3.6486 4.0345 3.9579 3.7518 3.8805 3.9458 3.6105 3.9715 3.8222 3.8783 3.8953 3.8818 1.0006 1.0311 1.0019 1.0022 1.0052 0.9986 1.0004 1.0158 1.0172 1.0035 1.0042 0.9990 1.0134 0.9970 0.9970 0.9915 1.0097 1.0244 0.9997 0.9886 0.9955 1.0101 1.0041 0.9882 0.9912 0.9896
dispcorr: -0.027542773 hartree
energy: -1117.881507067140
dipole: -14.15612 13.72811 -0.42802 -16.55562 16.84022 0.28460 6.86981 -6.48288 0.38693
magnitude: 0.64336 au
magnitude: 1.63529 debye
