program: Orca
programVersion: 5.0.2
elementType: O O O C C C C C C C C C C C C C C C C C C C C C C C H H H H H H H H H H H H H H H H H H H H H H H H H H
charge: 0
multiplicity: 1
keywords: wb97x-d3
keywords: def2-TZVPP
keywords: def2/J RIJCOSX
keywords: DEFGRID2
keywords: scfconv7
keywords: smallprint printgap noloewdin
keywords: NOSOSCF
formula: C23H26O3
InChI: InChI=1/C23H26O3/c1-16(2)13-20-21(23(20,3)4)22(24)25-15-17-9-8-12-19(14-17)26-18-10-6-5-7-11-18/h5-14,20-21H,15H2,1-4H3
52 atoms
O  -2.293925 2.179015 -0.626089
O  -1.903335 0.332177 -1.817482
O  2.339946 1.045504 0.965986
C  -4.044739 -1.052351 -0.052683
C  -2.87908 -1.013084 0.885468
C  -3.313041 0.256767 0.133142
C  -5.416913 -1.08923 0.580158
C  -3.987744 -1.829775 -1.34559
C  -1.597166 -1.690986 0.621708
C  -2.444297 0.872002 -0.880462
C  -0.762732 -2.177246 1.549732
C  0.495245 -2.887143 1.148472
C  -0.960463 -2.084547 3.03152
C  -1.456857 2.934586 -1.49128
C  0.011405 2.64951 -1.323573
C  0.516527 1.935526 -0.243315
C  0.891163 3.153256 -2.276694
C  1.883402 1.735428 -0.133323
C  2.257667 2.959929 -2.143645
C  2.768762 2.248712 -1.068524
C  3.02114 -0.128651 0.786887
C  2.988384 -0.860589 -0.393682
C  3.73721 -0.593203 1.885026
C  3.680368 -2.062739 -0.464603
C  4.415778 -1.798564 1.799475
C  4.393779 -2.54034 0.624628
H  -3.153935 -0.956317 1.932114
H  -3.817078 0.982664 0.760124
H  -6.166477 -0.66852 -0.092926
H  -5.451762 -0.5252 1.512864
H  -5.708088 -2.11758 0.801765
H  -2.991656 -1.945308 -1.761107
H  -4.613183 -1.35797 -2.105158
H  -4.385082 -2.831915 -1.174568
H  -1.310664 -1.828063 -0.41466
H  0.645162 -2.887066 0.069632
H  0.477507 -3.926331 1.487548
H  1.370428 -2.427376 1.614556
H  -1.90621 -1.639423 3.331374
H  -0.158855 -1.494387 3.482715
H  -0.901522 -3.076613 3.484987
H  -1.660516 3.974252 -1.233489
H  -1.752832 2.796884 -2.533822
H  -0.130306 1.527607 0.523932
H  0.506188 3.704531 -3.126111
H  2.933134 3.362764 -2.886602
H  3.834937 2.091358 -0.965811
H  2.422217 -0.520658 -1.250641
H  3.755078 -0.014973 2.800279
H  3.648203 -2.63208 -1.38435
H  4.969837 -2.15597 2.657647
H  4.928176 -3.478467 0.559673
elementType: O C H
totalener: -1117.85378120 hartree
nucrepener: 2334.58924112 hartree
electener: -3452.44302233 hartree
oneelecener: -6159.69174297 hartree
twoeener: 2707.24872064 hartree
cpcmener: -0.03077019 hartree
kineticenergy: 1112.80098027 hartree
xcener: -110.233235541083 hartree
chargesum: 0.0000000
charge: -0.301818 -0.484812 -0.340415 0.115901 0.037856 -0.087967 -0.264287 -0.288595 -0.305305 0.392544 -0.051177 -0.226297 -0.256713 0.087477 0.019927 -0.231137 -0.210627 0.241110 -0.136693 -0.186968 0.319017 -0.189894 -0.259703 -0.183447 -0.119041 -0.189529 0.118481 0.097583 0.094251 0.088247 0.095548 0.094913 0.103835 0.096018 0.122314 0.094015 0.111108 0.070816 0.090476 0.099101 0.097062 0.130860 0.120018 0.131008 0.146224 0.162240 0.158747 0.151433 0.144831 0.161084 0.160194 0.160186
qa: -0.3018 -0.4848 -0.3404 0.1159 0.0379 -0.0880 -0.2643 -0.2886 -0.3053 0.3925 -0.0512 -0.2263 -0.2567 0.0875 0.0199 -0.2311 -0.2106 0.2411 -0.1367 -0.1870 0.3190 -0.1899 -0.2597 -0.1834 -0.1190 -0.1895 0.1185 0.0976 0.0943 0.0882 0.0955 0.0949 0.1038 0.0960 0.1223 0.0940 0.1111 0.0708 0.0905 0.0991 0.0971 0.1309 0.1200 0.1310 0.1462 0.1622 0.1587 0.1514 0.1448 0.1611 0.1602 0.1602
va: 2.1090 2.0009 2.0433 3.7347 3.7307 3.8286 3.9032 3.8954 3.8411 4.0839 3.7765 3.9278 3.9412 3.8028 3.6492 4.0387 3.9594 3.7483 3.8808 3.9456 3.6072 3.8202 3.9732 3.8920 3.8784 3.8836 1.0004 1.0305 1.0022 1.0051 1.0018 1.0139 0.9990 1.0006 1.0184 1.0029 0.9984 1.0007 1.0137 0.9966 0.9971 0.9916 1.0100 1.0254 0.9997 0.9887 0.9956 1.0042 1.0103 0.9910 0.9883 0.9897
dispcorr: -0.027685636 hartree
energy: -1117.881466837790
dipole: -14.15738 13.72163 -0.43574 -17.01048 17.25806 0.24758 5.88278 -5.50791 0.37487
magnitude: 0.62586 au
magnitude: 1.59080 debye
