program: Orca
programVersion: 5.0.2
elementType: O O O C C C C C C C C C C C C C C C C C C C C C C C H H H H H H H H H H H H H H H H H H H H H H H H H H
charge: 0
multiplicity: 1
keywords: wb97x-d3
keywords: def2-TZVPP
keywords: def2/J RIJCOSX
keywords: DEFGRID2
keywords: scfconv7
keywords: smallprint printgap noloewdin
keywords: NOSOSCF
formula: C23H26O3
InChI: InChI=1/C23H26O3/c1-16(2)13-20-21(23(20,3)4)22(24)25-15-17-9-8-12-19(14-17)26-18-10-6-5-7-11-18/h5-14,20-21H,15H2,1-4H3
52 atoms
O  -2.030222 2.071419 0.515031
O  -2.859472 0.971533 -1.244455
O  3.135625 1.151652 0.816776
C  -4.671546 -0.511054 0.797157
C  -3.390198 -1.268224 0.802141
C  -3.376165 0.25442 0.98684
C  -5.527804 -0.593113 2.039676
C  -5.488207 -0.379403 -0.464572
C  -2.837855 -1.910514 -0.41744
C  -2.763155 1.10202 -0.045332
C  -1.536359 -2.065268 -0.672174
C  -1.0536 -2.72323 -1.927499
C  -0.454651 -1.571628 0.23581
C  -1.229534 2.892414 -0.347787
C  0.025218 2.172766 -0.754838
C  1.017886 1.950108 0.194512
C  0.195702 1.693498 -2.048638
C  2.175489 1.271069 -0.154104
C  1.357373 1.012667 -2.386637
C  2.355788 0.798143 -1.448971
C  3.947198 0.043318 0.846735
C  3.430804 -1.242284 0.742155
C  5.303187 0.250152 1.051283
C  4.290746 -2.326348 0.83607
C  6.150741 -0.844631 1.154163
C  5.651011 -2.134551 1.041681
H  -3.161279 -1.783835 1.731281
H  -3.180905 0.589762 1.99848
H  -6.153966 0.295148 2.141284
H  -4.925284 -0.682231 2.944214
H  -6.187954 -1.461222 1.992874
H  -6.227731 -1.181414 -0.498844
H  -4.906841 -0.435424 -1.379964
H  -6.033159 0.566078 -0.472065
H  -3.554486 -2.288008 -1.141088
H  -0.446667 -3.604278 -1.704545
H  -0.411701 -2.04246 -2.493856
H  -1.874034 -3.031869 -2.574979
H  0.157437 -0.824251 -0.276002
H  0.220384 -2.38785 0.505856
H  -0.827236 -1.127358 1.156602
H  -0.993495 3.770484 0.251189
H  -1.800812 3.221939 -1.216154
H  0.899322 2.317264 1.207568
H  -0.571457 1.857424 -2.793888
H  1.493337 0.647205 -3.395957
H  3.261277 0.277371 -1.732707
H  2.370161 -1.401583 0.594819
H  5.690042 1.257811 1.134825
H  3.889523 -3.327905 0.753609
H  7.208398 -0.683579 1.316189
H  6.315298 -2.984861 1.117078
elementType: O C H
totalener: -1117.85307668 hartree
nucrepener: 2312.73645968 hartree
electener: -3430.58953636 hartree
oneelecener: -6115.57687234 hartree
twoeener: 2684.98733598 hartree
cpcmener: -0.03032345 hartree
kineticenergy: 1112.81043918 hartree
xcener: -110.231707900343 hartree
chargesum: 0.0000000
charge: -0.296009 -0.492947 -0.340732 0.131960 -0.011229 -0.111894 -0.265921 -0.298193 -0.273600 0.404456 -0.029727 -0.226834 -0.210396 0.089331 0.005752 -0.274393 -0.182004 0.277701 -0.164022 -0.166345 0.184963 -0.110254 -0.194802 -0.217146 -0.157499 -0.148048 0.115347 0.094854 0.095439 0.088128 0.094194 0.098566 0.092326 0.102654 0.122869 0.097739 0.091682 0.091578 0.025305 0.115189 0.102489 0.125620 0.115294 0.132998 0.142002 0.161234 0.155293 0.188747 0.148396 0.158028 0.160556 0.161305
qa: -0.2960 -0.4929 -0.3407 0.1320 -0.0112 -0.1119 -0.2659 -0.2982 -0.2736 0.4045 -0.0297 -0.2268 -0.2104 0.0893 0.0058 -0.2744 -0.1820 0.2777 -0.1640 -0.1663 0.1850 -0.1103 -0.1948 -0.2171 -0.1575 -0.1480 0.1153 0.0949 0.0954 0.0881 0.0942 0.0986 0.0923 0.1027 0.1229 0.0977 0.0917 0.0916 0.0253 0.1152 0.1025 0.1256 0.1153 0.1330 0.1420 0.1612 0.1553 0.1887 0.1484 0.1580 0.1606 0.1613
va: 2.1079 1.9924 2.0631 3.7389 3.8126 3.8290 3.9013 3.8917 3.8477 4.1036 3.6802 3.9249 3.9248 3.7997 3.6208 4.0168 3.8787 3.7137 3.8985 3.8547 3.7644 3.8062 3.9593 3.9655 3.9024 3.8630 1.0055 1.0309 1.0021 1.0044 1.0023 0.9989 1.0156 1.0001 0.9991 0.9966 0.9960 1.0071 1.0224 1.0007 1.0084 0.9958 1.0100 1.0219 1.0133 0.9913 0.9971 0.9567 1.0061 0.9943 0.9888 0.9892
dispcorr: -0.028614437 hartree
energy: -1117.881691113121
dipole: -18.20318 18.61720 0.41402 -13.69774 13.19298 -0.50475 -0.87058 1.44156 0.57098
magnitude: 0.86730 au
magnitude: 2.20450 debye
