program: Orca
programVersion: 5.0.2
elementType: O O O C C C C C C C C C C C C C C C C C C C C C C C H H H H H H H H H H H H H H H H H H H H H H H H H H
charge: 0
multiplicity: 1
keywords: wb97x-d3
keywords: def2-TZVPP
keywords: def2/J RIJCOSX
keywords: DEFGRID2
keywords: scfconv7
keywords: smallprint printgap noloewdin
keywords: NOSOSCF
formula: C23H26O3
InChI: InChI=1/C23H26O3/c1-16(2)13-20-21(23(20,3)4)22(24)25-15-17-9-8-12-19(14-17)26-18-10-6-5-7-11-18/h5-14,20-21H,15H2,1-4H3
52 atoms
O  -1.859506 0.503066 -1.154348
O  -2.475358 2.308381 -0.001669
O  2.836376 1.224992 0.857099
C  -4.195901 -0.83925 0.415345
C  -2.878514 -1.30243 0.934871
C  -3.151123 0.196858 0.800242
C  -5.377642 -0.921919 1.351625
C  -4.578419 -1.056495 -1.027095
C  -1.90034 -2.046751 0.109787
C  -2.480987 1.103451 -0.145792
C  -0.65183 -2.307194 0.504572
C  0.281891 -3.122894 -0.332573
C  -0.107624 -1.797963 1.808331
C  -1.133522 1.324525 -2.069439
C  0.074857 1.966381 -1.446193
C  0.901361 1.244667 -0.589979
C  0.380648 3.287724 -1.750309
C  2.026019 1.856388 -0.052117
C  1.509922 3.884278 -1.209589
C  2.341813 3.171907 -0.360695
C  3.24759 -0.067574 0.663293
C  3.515158 -0.806407 1.808772
C  3.455555 -0.616414 -0.596178
C  3.990011 -2.103984 1.691763
C  3.921699 -1.920558 -0.696423
C  4.189436 -2.670882 0.440183
H  -2.884778 -1.600861 1.9801
H  -3.36081 0.707968 1.732782
H  -5.854553 -1.900975 1.276809
H  -6.126817 -0.167259 1.106064
H  -5.081475 -0.774676 2.390871
H  -3.744131 -1.02457 -1.722205
H  -5.303306 -0.30455 -1.343855
H  -5.053488 -2.033434 -1.134794
H  -2.236959 -2.435457 -0.845686
H  -0.195065 -3.487541 -1.242483
H  0.659079 -3.985759 0.222658
H  1.158798 -2.536521 -0.620528
H  -0.471828 -2.390146 2.652133
H  -0.394965 -0.762256 1.997122
H  0.980474 -1.849577 1.830528
H  -1.785648 2.080221 -2.51119
H  -0.833641 0.640854 -2.863648
H  0.666714 0.216987 -0.335139
H  -0.270873 3.852913 -2.404796
H  1.74394 4.913631 -1.446168
H  3.22129 3.632991 0.070286
H  3.35191 -0.366107 2.784163
H  3.263114 -0.044225 -1.49438
H  4.196304 -2.675029 2.587441
H  4.078893 -2.348277 -1.677976
H  4.552113 -3.685884 0.351502
elementType: O C H
totalener: -1117.84967306 hartree
nucrepener: 2364.82696114 hartree
electener: -3482.67663421 hartree
oneelecener: -6219.40055800 hartree
twoeener: 2736.72392380 hartree
cpcmener: -0.03243193 hartree
kineticenergy: 1112.81967366 hartree
xcener: -110.236234359338 hartree
chargesum: 0.0000000
charge: -0.271056 -0.500818 -0.338675 0.129560 -0.029577 -0.136805 -0.264477 -0.290925 -0.259089 0.429695 -0.003979 -0.231999 -0.284597 0.059905 0.015790 -0.189013 -0.208461 0.270850 -0.120670 -0.245339 0.313713 -0.282125 -0.199747 -0.079459 -0.140346 -0.222981 0.115507 0.094478 0.093814 0.095765 0.088060 0.090405 0.103549 0.102646 0.126572 0.094270 0.106558 0.075611 0.119955 0.100950 0.069929 0.121171 0.118528 0.128388 0.142932 0.160396 0.147525 0.147802 0.153784 0.161355 0.162097 0.158578
qa: -0.2711 -0.5008 -0.3387 0.1296 -0.0296 -0.1368 -0.2645 -0.2909 -0.2591 0.4297 -0.0040 -0.2320 -0.2846 0.0599 0.0158 -0.1890 -0.2085 0.2709 -0.1207 -0.2453 0.3137 -0.2821 -0.1997 -0.0795 -0.1403 -0.2230 0.1155 0.0945 0.0938 0.0958 0.0881 0.0904 0.1035 0.1026 0.1266 0.0943 0.1066 0.0756 0.1200 0.1009 0.0699 0.1212 0.1185 0.1284 0.1429 0.1604 0.1475 0.1478 0.1538 0.1614 0.1621 0.1586
va: 2.1073 1.9999 2.0651 3.7842 3.7623 3.8752 3.8995 3.9050 3.8204 4.1017 3.6791 3.9066 3.9199 3.7976 3.6589 3.9166 3.9445 3.6952 3.8880 3.9921 3.6155 3.9702 3.8560 3.8068 3.8307 3.8934 1.0001 1.0295 1.0022 1.0020 1.0052 1.0119 1.0001 0.9987 1.0014 1.0137 0.9939 0.9982 1.0011 0.9984 1.0275 1.0054 0.9954 1.0060 1.0015 0.9880 1.0061 1.0101 0.9990 0.9867 0.9903 0.9915
dispcorr: -0.030146842 hartree
energy: -1117.879819903750
dipole: -14.82949 14.80759 -0.02189 -17.38101 15.79047 -1.59054 1.28029 -2.03501 -0.75472
magnitude: 1.76065 au
magnitude: 4.47521 debye
