program: Orca
programVersion: 5.0.2
elementType: O O O C C C C C C C C C C C C C C C C C C C C C C C H H H H H H H H H H H H H H H H H H H H H H H H H H
charge: 0
multiplicity: 1
keywords: wb97x-d3
keywords: def2-TZVPP
keywords: def2/J RIJCOSX
keywords: DEFGRID2
keywords: scfconv7
keywords: smallprint printgap noloewdin
keywords: NOSOSCF
formula: C23H26O3
InChI: InChI=1/C23H26O3/c1-16(2)13-20-21(23(20,3)4)22(24)25-15-17-9-8-12-19(14-17)26-18-10-6-5-7-11-18/h5-14,20-21H,15H2,1-4H3
52 atoms
O  -1.875365 0.474743 -1.126198
O  -2.530337 2.307734 -0.041708
O  2.867302 1.131191 0.821702
C  -4.236392 -0.88655 0.306555
C  -2.974161 -1.254927 1.004841
C  -3.289865 0.220904 0.747912
C  -5.517202 -0.968614 1.103152
C  -4.440155 -1.207407 -1.153226
C  -1.865218 -1.987552 0.349152
C  -2.540626 1.100155 -0.162926
C  -0.640817 -2.101007 0.869611
C  0.426168 -2.907399 0.196812
C  -0.248134 -1.432975 2.154266
C  -1.131945 1.270739 -2.050712
C  0.078094 1.911308 -1.431218
C  0.91561 1.179558 -0.595357
C  0.37808 3.23735 -1.720612
C  2.044802 1.785049 -0.061566
C  1.512243 3.828102 -1.183995
C  2.354517 3.105458 -0.353646
C  3.294541 -0.144631 0.557343
C  3.51246 -0.967017 1.654904
C  3.562044 -0.595077 -0.729595
C  3.997457 -2.252059 1.461468
C  4.038551 -1.887106 -0.907431
C  4.257904 -2.720651 0.180772
H  -3.095631 -1.494766 2.057868
H  -3.62725 0.770785 1.618628
H  -5.355828 -0.740472 2.157236
H  -5.940988 -1.972861 1.041073
H  -6.262764 -0.269512 0.719906
H  -5.125503 -0.489916 -1.607716
H  -4.894858 -2.195425 -1.246513
H  -3.529255 -1.214495 -1.744448
H  -2.081127 -2.494555 -0.586246
H  1.26266 -2.270437 -0.103062
H  0.056274 -3.417152 -0.692682
H  0.838256 -3.661155 0.872875
H  -0.412871 -2.094011 3.008702
H  -0.807824 -0.517373 2.339028
H  0.811953 -1.181687 2.156849
H  -1.773077 2.022711 -2.513913
H  -0.832772 0.568184 -2.828077
H  0.68676 0.146884 -0.355532
H  -0.280056 3.809808 -2.362105
H  1.742852 4.860606 -1.410414
H  3.238945 3.561665 0.071898
H  3.304956 -0.601091 2.652586
H  3.407796 0.04562 -1.588424
H  4.163902 -2.890184 2.319358
H  4.244215 -2.238615 -1.909982
H  4.628959 -3.725785 0.032091
elementType: O C H
totalener: -1117.85082674 hartree
nucrepener: 2366.73027013 hartree
electener: -3484.58109687 hartree
oneelecener: -6223.20486215 hartree
twoeener: 2738.62376528 hartree
cpcmener: -0.03269595 hartree
kineticenergy: 1112.82057320 hartree
xcener: -110.236758991596 hartree
chargesum: -0.0000000
charge: -0.271240 -0.504078 -0.342103 0.140984 -0.035010 -0.149664 -0.266653 -0.294225 -0.239640 0.437670 -0.019251 -0.216626 -0.297842 0.060992 0.004981 -0.184911 -0.201909 0.256167 -0.122862 -0.237483 0.287594 -0.270693 -0.176006 -0.112752 -0.138473 -0.201486 0.116132 0.094574 0.088272 0.094097 0.096242 0.104100 0.101425 0.091457 0.128348 0.039472 0.096969 0.108603 0.118763 0.103090 0.093459 0.120345 0.118729 0.144259 0.143255 0.160332 0.147624 0.152215 0.152278 0.160035 0.160526 0.159916
qa: -0.2712 -0.5041 -0.3421 0.1410 -0.0350 -0.1497 -0.2667 -0.2942 -0.2396 0.4377 -0.0193 -0.2166 -0.2978 0.0610 0.0050 -0.1849 -0.2019 0.2562 -0.1229 -0.2375 0.2876 -0.2707 -0.1760 -0.1128 -0.1385 -0.2015 0.1161 0.0946 0.0883 0.0941 0.0962 0.1041 0.1014 0.0915 0.1283 0.0395 0.0970 0.1086 0.1188 0.1031 0.0935 0.1203 0.1187 0.1443 0.1433 0.1603 0.1476 0.1522 0.1523 0.1600 0.1605 0.1599
va: 2.1069 1.9974 2.0564 3.7551 3.7840 3.8743 3.9006 3.9054 3.8040 4.0981 3.6866 3.9319 3.9435 3.8025 3.6786 3.9197 3.9341 3.6980 3.8900 3.9960 3.6510 3.9390 3.8619 3.8417 3.8523 3.8898 1.0007 1.0291 1.0050 1.0021 1.0018 0.9998 0.9988 1.0113 1.0009 1.0023 1.0156 0.9930 0.9989 1.0011 1.0008 1.0058 0.9955 0.9879 1.0015 0.9880 1.0059 1.0063 1.0000 0.9890 0.9903 0.9903
dispcorr: -0.030408001 hartree
energy: -1117.881234737926
dipole: -14.79483 14.78845 -0.00638 -16.57795 14.98553 -1.59242 2.00471 -2.76561 -0.76090
magnitude: 1.76488 au
magnitude: 4.48598 debye
