program: Orca
programVersion: 5.0.2
elementType: O O O C C C C C C C C C C C C C C C C C C C C C C C H H H H H H H H H H H H H H H H H H H H H H H H H H
charge: 0
multiplicity: 1
keywords: wb97x-d3
keywords: def2-TZVPP
keywords: def2/J RIJCOSX
keywords: DEFGRID2
keywords: scfconv7
keywords: smallprint printgap noloewdin
keywords: NOSOSCF
formula: C23H26O3
InChI: InChI=1/C23H26O3/c1-16(2)13-20-21(23(20,3)4)22(24)25-15-17-9-8-12-19(14-17)26-18-10-6-5-7-11-18/h5-14,20-21H,15H2,1-4H3
52 atoms
O  -2.169576 2.113199 0.289147
O  -2.540748 0.741153 -1.432084
O  2.85871 1.096069 0.914682
C  -4.614642 -0.673811 0.395519
C  -3.310488 -1.2863 0.762743
C  -3.451504 0.242384 0.732953
C  -5.700171 -0.70084 1.446288
C  -5.165624 -0.780594 -1.005015
C  -2.443259 -1.998481 -0.206752
C  -2.701431 1.017236 -0.264618
C  -1.123408 -2.140724 -0.059297
C  -0.29321 -2.862353 -1.074459
C  -0.365456 -1.552141 1.090419
C  -1.370398 2.956492 -0.548097
C  -0.038628 2.343074 -0.87798
C  0.814847 1.949996 0.147822
C  0.356096 2.171322 -2.199132
C  2.053331 1.402545 -0.150562
C  1.602652 1.632626 -2.486327
C  2.462099 1.245985 -1.469667
C  3.681595 -0.000789 0.886415
C  3.30472 -1.207967 0.309548
C  4.903461 0.123507 1.533357
C  4.168649 -2.291441 0.384574
C  5.751592 -0.971749 1.609389
C  5.391691 -2.182181 1.03297
H  -3.247441 -1.656896 1.782561
H  -3.504141 0.716485 1.705872
H  -6.266267 -1.632195 1.385439
H  -6.401492 0.123776 1.305883
H  -5.292623 -0.624782 2.455034
H  -5.795856 -1.669101 -1.075153
H  -4.409557 -0.857357 -1.780446
H  -5.792875 0.082229 -1.2354
H  -2.918415 -2.431436 -1.081736
H  0.46135 -2.194991 -1.500506
H  -0.894188 -3.256433 -1.893773
H  0.252336 -3.69349 -0.620775
H  -1.003509 -1.262495 1.923688
H  0.177842 -0.658918 0.769817
H  0.383135 -2.252122 1.467117
H  -1.236248 3.86621 0.036139
H  -1.91152 3.222127 -1.457869
H  0.525347 2.075146 1.184859
H  -0.306931 2.463328 -3.003533
H  1.9126 1.509025 -3.515537
H  3.434408 0.834776 -1.708001
H  2.350018 -1.314472 -0.189961
H  5.183366 1.069186 1.979979
H  3.87357 -3.231442 -0.063033
H  6.701568 -0.872111 2.117824
H  6.056563 -3.033454 1.090501
elementType: O C H
totalener: -1117.85280365 hartree
nucrepener: 2323.36081692 hartree
electener: -3441.21362057 hartree
oneelecener: -6136.91327879 hartree
twoeener: 2695.69965822 hartree
cpcmener: -0.03169219 hartree
kineticenergy: 1112.80700796 hartree
xcener: -110.231281468724 hartree
chargesum: 0.0000000
charge: -0.299146 -0.494238 -0.342491 0.136175 -0.019674 -0.108428 -0.264056 -0.297826 -0.272941 0.410610 0.013724 -0.246976 -0.290808 0.101501 0.032153 -0.320870 -0.196656 0.301825 -0.148501 -0.193457 0.322678 -0.204644 -0.243220 -0.178380 -0.132905 -0.176758 0.111113 0.091729 0.094220 0.095945 0.087861 0.099458 0.090337 0.102704 0.126812 0.095501 0.097834 0.099614 0.107798 0.078978 0.109488 0.126246 0.114949 0.138083 0.146331 0.162173 0.157272 0.150247 0.146695 0.159920 0.160810 0.161192
qa: -0.2991 -0.4942 -0.3425 0.1362 -0.0197 -0.1084 -0.2641 -0.2978 -0.2729 0.4106 0.0137 -0.2470 -0.2908 0.1015 0.0322 -0.3209 -0.1967 0.3018 -0.1485 -0.1935 0.3227 -0.2046 -0.2432 -0.1784 -0.1329 -0.1768 0.1111 0.0917 0.0942 0.0959 0.0879 0.0995 0.0903 0.1027 0.1268 0.0955 0.0978 0.0996 0.1078 0.0790 0.1095 0.1262 0.1149 0.1381 0.1463 0.1622 0.1573 0.1502 0.1467 0.1599 0.1608 0.1612
va: 2.1082 1.9933 2.0586 3.7493 3.8048 3.8465 3.8991 3.8926 3.8298 4.0823 3.6347 3.9331 3.9647 3.7938 3.5980 3.9738 3.9390 3.6730 3.9063 3.8966 3.6255 3.8777 3.9947 3.9402 3.8882 3.8932 1.0069 1.0318 1.0023 1.0024 1.0044 0.9985 1.0177 0.9999 1.0000 0.9927 1.0088 0.9972 1.0098 0.9950 1.0014 0.9932 1.0073 1.0246 1.0049 0.9896 0.9957 0.9874 1.0084 0.9917 0.9881 0.9889
dispcorr: -0.028528888 hartree
energy: -1117.881332540951
dipole: -16.57323 16.69886 0.12564 -14.10367 13.91681 -0.18686 0.32812 0.21738 0.54550
magnitude: 0.59015 au
magnitude: 1.50003 debye
