program: Orca
programVersion: 5.0.2
elementType: O O O C C C C C C C C C C C C C C C C C C C C C C C H H H H H H H H H H H H H H H H H H H H H H H H H H
charge: 0
multiplicity: 1
keywords: wb97x-d3
keywords: def2-TZVPP
keywords: def2/J RIJCOSX
keywords: DEFGRID2
keywords: scfconv7
keywords: smallprint printgap noloewdin
keywords: NOSOSCF
formula: C23H26O3
InChI: InChI=1/C23H26O3/c1-16(2)13-20-21(23(20,3)4)22(24)25-15-17-9-8-12-19(14-17)26-18-10-6-5-7-11-18/h5-14,20-21H,15H2,1-4H3
52 atoms
O  -1.93807 1.391365 -0.594119
O  -4.017303 2.182883 -0.563372
O  3.001167 1.104183 0.576568
C  -2.972988 -1.407031 -0.580688
C  -3.055079 -1.015373 0.860413
C  -3.697393 -0.127963 -0.200093
C  -3.891405 -2.518139 -1.035824
C  -1.658198 -1.408541 -1.323806
C  -1.9067 -0.54426 1.679418
C  -3.248311 1.252013 -0.469673
C  -0.87998 -1.299251 2.07865
C  0.193243 -0.742232 2.964582
C  -0.703791 -2.736075 1.698491
C  -1.406147 2.704474 -0.797418
C  0.063661 2.544487 -1.045665
C  0.864077 1.895216 -0.108535
C  0.637914 3.025678 -2.215174
C  2.213856 1.727395 -0.360104
C  1.997998 2.866569 -2.447693
C  2.794444 2.208344 -1.52515
C  3.167041 -0.247487 0.508378
C  2.521632 -1.059442 -0.416841
C  4.03476 -0.801856 1.445149
C  2.751056 -2.430572 -0.39246
C  4.251843 -2.169503 1.453878
C  3.611977 -2.99426 0.536243
H  -3.8022 -1.561557 1.432889
H  -4.778788 -0.18696 -0.243142
H  -4.84857 -2.502273 -0.512692
H  -3.431995 -3.49275 -0.856227
H  -4.09706 -2.442111 -2.105715
H  -1.779445 -1.035954 -2.342887
H  -1.295383 -2.435326 -1.400488
H  -0.87657 -0.827825 -0.842448
H  -1.951768 0.480324 2.038514
H  0.022724 0.305233 3.213241
H  1.174613 -0.822865 2.489536
H  0.260234 -1.303605 3.900708
H  -0.61604 -3.359606 2.592425
H  0.223382 -2.877383 1.13627
H  -1.52466 -3.127501 1.100214
H  -1.593603 3.315979 0.089181
H  -1.887539 3.188688 -1.64897
H  0.441493 1.514296 0.814499
H  0.021022 3.52658 -2.951039
H  2.437262 3.247888 -3.360021
H  3.853702 2.070997 -1.703371
H  1.844825 -0.648426 -1.154294
H  4.532638 -0.160469 2.161894
H  2.244366 -3.058203 -1.114673
H  4.928729 -2.592518 2.185076
H  3.784383 -4.062276 0.546249
elementType: O C H
totalener: -1117.86330583 hartree
nucrepener: 2374.98740387 hartree
electener: -3492.85070970 hartree
oneelecener: -6238.86325279 hartree
twoeener: 2746.01254309 hartree
cpcmener: -0.02536606 hartree
kineticenergy: 1112.80610492 hartree
xcener: -110.228200261313 hartree
chargesum: 0.0000000
charge: -0.260074 -0.476827 -0.327953 0.091928 0.000364 -0.096607 -0.274278 -0.239850 -0.269715 0.392828 -0.024688 -0.227203 -0.257679 0.071983 -0.030760 -0.215917 -0.146921 0.206583 -0.151671 -0.154449 0.291928 -0.183538 -0.221759 -0.211213 -0.131691 -0.163885 0.111232 0.092398 0.087142 0.090479 0.098906 0.112983 0.095580 0.046657 0.115756 0.094938 0.069080 0.113291 0.108920 0.090235 0.093879 0.122012 0.101673 0.147936 0.144511 0.157992 0.150693 0.150326 0.141325 0.159489 0.156528 0.157101
qa: -0.2601 -0.4768 -0.3280 0.0919 0.0004 -0.0966 -0.2743 -0.2398 -0.2697 0.3928 -0.0247 -0.2272 -0.2577 0.0720 -0.0308 -0.2159 -0.1469 0.2066 -0.1517 -0.1544 0.2919 -0.1835 -0.2218 -0.2112 -0.1317 -0.1639 0.1112 0.0924 0.0871 0.0905 0.0989 0.1130 0.0956 0.0467 0.1158 0.0949 0.0691 0.1133 0.1089 0.0902 0.0939 0.1220 0.1017 0.1479 0.1445 0.1580 0.1507 0.1503 0.1413 0.1595 0.1565 0.1571
va: 2.1170 2.0316 2.0697 3.6951 3.7888 3.8790 3.9154 3.8802 3.8508 4.1458 3.6516 3.9162 3.9371 3.8208 3.7524 3.9269 3.8994 3.7876 3.9087 3.9667 3.6454 3.7879 3.9438 3.9046 3.9078 3.8706 1.0057 1.0272 1.0058 1.0034 1.0004 1.0063 1.0000 1.0079 1.0124 1.0055 1.0056 1.0008 1.0024 1.0033 1.0066 0.9942 1.0105 1.0068 0.9999 0.9902 0.9994 1.0032 1.0109 0.9927 0.9888 0.9897
dispcorr: -0.031168905 hartree
energy: -1117.894474735787
dipole: -7.33524 8.24530 0.91006 -18.76248 17.58986 -1.17262 3.39014 -3.73582 -0.34568
magnitude: 1.52405 au
magnitude: 3.87383 debye
