program: Gaussian 09
title: 000004944
version: EM64L-G09RevD.01
frameworkgroup: C1[X(C11H15NO3)]
method: RPBEPBE
basis: SDD
operation: Freq
keyword: #p
keyword: freq=noraman
keyword: PBEPBE/SDD
title: #p freq=noraman PBEPBE/SDD
converged: YES YES NO NO
title: Mulliken charges:
elementType: O O O N C C C C C C C C C C C H H H H H H H H H H H H H H H
charge: -0.291344 -0.341017 -0.262591 -0.368135 0.025297 0.306461 -0.696424 -0.689023 0.240408 -0.345876 -0.345351 -0.238351 -0.232983 0.292418 -0.604216 0.190335 0.203846 0.232306 0.227231 0.204589 0.243494 0.254711 0.234653 0.248765 0.224069 0.228244 0.332615 0.229148 0.227830 0.268892
chargesum: 0.00000
title: Mulliken charges with hydrogens summed into heavy atoms:
elementType: O O O N C C C C C C C C C C C
charge: -0.291344 -0.341017 -0.262591 -0.035520 0.215632 0.306461 -0.033042 0.013772 0.240408 -0.111223 -0.096586 -0.014282 -0.004740 0.292418 0.121653
polarizability: 1.74461246e+02 -1.06369260e+01 1.46855811e+02 1.05409964e+01 2.17891044e+00 8.94079883e+01
1716.lowfreq: -11.2204 -5.2000 -0.0004 -0.0004 0.0007 6.2315 32.2880 42.8731 57.1354
frequency: 32.2391 42.7716 57.0670 77.9641 85.7231 97.4132 127.1271 161.2040 174.2189 186.8049 232.4413 244.1146 266.4855 293.7463 326.1195 353.0964 394.6952 441.1098 457.3397 490.8801 540.3543 578.3414 581.0798 606.7587 647.6216 689.7230 725.4307 743.4249 754.4733 793.6044 845.4026 853.0685 881.7305 922.1042 926.2683 931.0830 944.7576 966.0855 1035.5803 1068.4286 1094.1028 1104.1495 1125.8798 1146.5426 1154.3266 1160.4474 1170.1448 1185.1021 1207.4492 1240.5724 1266.6731 1316.6298 1344.1444 1380.8441 1384.8058 1398.5193 1429.8149 1437.3005 1453.0127 1459.7240 1465.2674 1470.2629 1481.7688 1482.5161 1490.0637 1514.4490 1588.1819 1609.9121 1708.6159 2967.3238 2977.7126 2991.5757 2994.8213 3054.2129 3087.8767 3095.4791 3099.4627 3104.8965 3111.3069 3133.1271 3149.3791 3160.4351 3174.2862 3578.8894
redmass: 3.7457 3.7994 3.2440 2.4841 1.5597 3.0101 3.2172 1.6796 1.9176 2.9651 1.4154 2.4633 4.4649 4.7598 4.4452 3.3166 3.3027 2.7839 3.3705 4.5359 4.2415 1.4848 2.4333 6.6543 5.8824 9.3751 3.8211 4.2207 1.3310 4.6349 1.6157 2.9297 4.2424 3.0247 1.3483 1.3536 1.3557 1.3021 2.0321 4.9874 2.3207 1.8967 1.2843 1.6782 2.0405 1.6531 1.2896 1.9919 2.3350 3.0939 1.5031 1.3043 1.4151 2.6264 1.8468 1.2182 1.1633 2.3115 1.0565 1.3690 1.0581 1.0493 2.5364 1.0500 1.0577 1.4150 6.9911 7.0958 9.6111 1.0841 1.0355 1.0357 1.0362 1.1026 1.0990 1.0997 1.1007 1.1001 1.0980 1.0853 1.0895 1.0944 1.1003 1.0772
irintensity: 0.1001 11.8378 2.2695 0.8877 0.6982 2.3500 1.2429 1.0662 0.5866 0.1221 0.2115 2.2905 0.6537 1.9280 14.3809 7.1811 6.2770 5.4593 3.6956 0.5598 0.4972 78.8509 46.9752 1.8729 2.1431 25.7094 7.7866 6.4436 93.3451 3.3166 4.5850 32.9219 41.3352 38.8331 10.4917 8.2570 0.5334 0.0745 14.6267 131.0349 128.8232 140.3622 0.0717 65.5464 15.3709 74.0046 48.5745 86.5771 113.3048 202.5562 9.0058 8.0545 3.0258 21.6004 23.3987 31.5470 28.8790 20.4899 4.2008 175.6372 3.6538 1.2043 137.1269 10.8374 18.2846 112.9416 1.4908 34.3484 295.0831 41.8343 82.0060 16.4588 23.4664 38.1592 18.8030 36.3501 22.3929 29.6446 4.6342 2.4961 14.4841 24.0276 13.6915 42.0986
temp: 298.150 k
press: 1.00000 atm
elementType: 8 8 8 7 6 6 6 6 6 6 6 6 6 6 6 1 1 1 1 1 1 1 1 1 1 1 1 1 1 1
symmnumber: 1
zpe: 637190.2 jmol-1
zpe.correction: 0.242693 hartree
zpe.thermalcorrener: 0.258683 hartree
zpe.thermalcorrenthalpy: 0.259627 hartree
zpe.thermalcorrgfe: 0.198324 hartree
zpe.sumelectzpe: -707.457658 hartree
zpe.sumelectthermal: -707.441668 hartree
zpe.sumelectthermalent: -707.440724 hartree
zpe.sumelectthermalfe: -707.502027 hartree
dipole: -1.1861 1.2561 -1.3633
dipole: 2.2007
quadrupole: -70.4705 -77.5569 -95.1963
quadrupole: 3.9995 5.4147 1.6254
quadrupole: 10.6041 3.5177 -14.1217 3.9995 5.4147 1.6254
hfenergy: -707.7003507 hartree
pointgroup: C01 [X(C11H15N1O3)]
dipole: 0.0826203 0.6803619 0.5290853 debye
polarizability: 154.2764946|16.1710237|167.711878|7.1667313|3.6549192|88.7366725 unknown
InChI: InChI=1S/C11H15NO3/c1-8(2)14-9-6-4-5-7-10(9)15-11(13)12-3/h4-8,12H,1-3H3
charge 0 multiplicity 1
30 atoms
O  -0.762582 0.854505 0.737246
O  1.442687 -0.784704 0.658668
O  1.441482 0.52193 -1.336903
N  3.023916 0.810721 0.38236
C  -1.775039 1.880703 0.342588
C  -0.99618 -0.488953 0.436685
C  -1.290211 3.169509 1.012529
C  -1.855952 1.982989 -1.189409
C  0.154831 -1.326003 0.4035
C  -2.267716 -1.074628 0.222551
C  0.039259 -2.710914 0.203374
C  -2.382783 -2.468264 0.015471
C  -1.235895 -3.292415 0.013564
C  1.926408 0.244653 -0.217989
C  3.815516 1.856619 -0.266907
H  -2.756831 1.587453 0.77086
H  -1.996836 3.994255 0.810035
H  -1.207922 3.033529 2.104435
H  -0.297461 3.450355 0.619378
H  -2.55933 2.785569 -1.478033
H  -2.201583 1.038978 -1.644265
H  -0.85781 2.209249 -1.601769
H  -3.169273 -0.45427 0.232049
H  0.951721 -3.315175 0.19138
H  -3.374362 -2.90657 -0.142017
H  -1.326724 -4.371721 -0.144209
H  3.262602 0.482742 1.318216
H  4.864514 1.53749 -0.411037
H  3.803965 2.792705 0.321968
H  3.369794 2.056663 -1.254219
