program: Orca
programVersion: 5.0.2
elementType: O O O C C C C C C C C C C C C C C C C C C C C C C C H H H H H H H H H H H H H H H H H H H H H H H H H H
charge: 0
multiplicity: 1
keywords: wb97x-d3
keywords: def2-TZVPP
keywords: def2/J RIJCOSX
keywords: DEFGRID2
keywords: scfconv7
keywords: smallprint printgap noloewdin
keywords: NOSOSCF
formula: C23H26O3
InChI: InChI=1/C23H26O3/c1-16(2)13-20-21(23(20,3)4)22(24)25-15-17-9-8-12-19(14-17)26-18-10-6-5-7-11-18/h5-14,20-21H,15H2,1-4H3
52 atoms
O  -1.683424 0.987434 -0.597913
O  -3.829015 1.550805 -0.764331
O  3.240321 0.732038 0.299759
C  -2.584328 -1.935456 -0.80119
C  -2.567767 -1.618294 0.654586
C  -3.321003 -0.701395 -0.306868
C  -3.486982 -3.05647 -1.262987
C  -1.319822 -1.835426 -1.617831
C  -1.323131 -1.236151 1.370475
C  -2.979516 0.706758 -0.579022
C  -1.239308 -0.3533 2.368297
C  0.059903 -0.085497 3.063537
C  -2.40116 0.451226 2.862521
C  -1.307007 2.339705 -0.821877
C  0.189389 2.462242 -0.772068
C  1.010697 1.463658 -0.265224
C  0.753009 3.654251 -1.222416
C  2.388103 1.659936 -0.229257
C  2.123176 3.842492 -1.163238
C  2.953697 2.843742 -0.67567
C  3.005201 -0.605687 0.140909
C  2.599053 -1.147489 -1.072934
C  3.253865 -1.424227 1.233952
C  2.428643 -2.520549 -1.177486
C  3.088356 -2.796528 1.111886
C  2.668828 -3.350123 -0.089855
H  -3.256707 -2.207304 1.256286
H  -4.398405 -0.815875 -0.272788
H  -4.391374 -3.128374 -0.657383
H  -2.970398 -4.016679 -1.19997
H  -3.792635 -2.912493 -2.301358
H  -0.605937 -1.103864 -1.249798
H  -1.548067 -1.586024 -2.656042
H  -0.817206 -2.805103 -1.618947
H  -0.419923 -1.766558 1.077671
H  0.871721 -0.697423 2.670427
H  -0.020113 -0.282447 4.13615
H  0.350502 0.96418 2.964018
H  -2.210147 1.520829 2.737801
H  -2.55246 0.292968 3.933773
H  -3.337453 0.216508 2.359384
H  -1.755876 2.984921 -0.060974
H  -1.673956 2.680569 -1.793677
H  0.588145 0.539301 0.1068
H  0.116919 4.436567 -1.619168
H  2.555162 4.770811 -1.513884
H  4.026848 2.981947 -0.638655
H  2.420394 -0.513154 -1.932252
H  3.578285 -0.988248 2.17063
H  2.113452 -2.942805 -2.123005
H  3.283395 -3.432493 1.96572
H  2.53648 -4.420128 -0.181063
elementType: O C H
totalener: -1117.86395364 hartree
nucrepener: 2398.35475186 hartree
electener: -3516.21870549 hartree
oneelecener: -6285.69023691 hartree
twoeener: 2769.47153142 hartree
cpcmener: -0.02437359 hartree
kineticenergy: 1112.79643238 hartree
xcener: -110.231874724173 hartree
chargesum: -0.0000000
charge: -0.256100 -0.474055 -0.328704 0.148051 0.001558 -0.159919 -0.270916 -0.276205 -0.239030 0.405721 -0.030774 -0.238539 -0.264116 0.067262 0.053060 -0.183032 -0.239885 0.268180 -0.125576 -0.243829 0.319149 -0.188518 -0.277190 -0.185796 -0.114291 -0.161559 0.111475 0.095437 0.086463 0.092920 0.096081 0.061985 0.107139 0.096765 0.108161 0.084753 0.111701 0.094290 0.097414 0.108863 0.094079 0.118552 0.117252 0.087987 0.140705 0.155644 0.144692 0.154700 0.150136 0.162914 0.157911 0.157034
qa: -0.2561 -0.4741 -0.3287 0.1481 0.0016 -0.1599 -0.2709 -0.2762 -0.2390 0.4057 -0.0308 -0.2385 -0.2641 0.0673 0.0531 -0.1830 -0.2399 0.2682 -0.1256 -0.2438 0.3191 -0.1885 -0.2772 -0.1858 -0.1143 -0.1616 0.1115 0.0954 0.0865 0.0929 0.0961 0.0620 0.1071 0.0968 0.1082 0.0848 0.1117 0.0943 0.0974 0.1089 0.0941 0.1186 0.1173 0.0880 0.1407 0.1556 0.1447 0.1547 0.1501 0.1629 0.1579 0.1570
va: 2.1112 2.0324 2.0820 3.7096 3.7949 3.8788 3.9085 3.9235 3.8178 4.1109 3.6781 3.9104 3.9435 3.8201 3.7166 3.8545 3.9696 3.7471 3.9039 3.9949 3.6189 3.8470 3.9747 3.8652 3.8676 3.8780 1.0060 1.0287 1.0059 1.0020 1.0013 0.9959 1.0048 0.9986 0.9970 1.0069 1.0007 0.9971 0.9979 0.9995 1.0066 0.9939 0.9994 1.0370 1.0019 0.9895 1.0079 0.9980 1.0066 0.9885 0.9887 0.9902
dispcorr: -0.031544185 hartree
energy: -1117.895497820474
dipole: -10.65738 11.18760 0.53022 -11.49884 10.65580 -0.84304 5.36813 -5.28894 0.07919
magnitude: 0.99906 au
magnitude: 2.53941 debye
