program: Orca
programVersion: 5.0.2
elementType: O O O C C C C C C C C C C C C C C C C C C C C C C C H H H H H H H H H H H H H H H H H H H H H H H H H H
charge: 0
multiplicity: 1
keywords: wb97x-d3
keywords: def2-TZVPP
keywords: def2/J RIJCOSX
keywords: DEFGRID2
keywords: scfconv7
keywords: smallprint printgap noloewdin
keywords: NOSOSCF
formula: C23H26O3
InChI: InChI=1/C23H26O3/c1-16(2)13-20-21(23(20,3)4)22(24)25-15-17-9-8-12-19(14-17)26-18-10-6-5-7-11-18/h5-14,20-21H,15H2,1-4H3
52 atoms
O  -1.786916 2.050432 -0.221599
O  -2.193889 0.467384 -1.749782
O  3.145577 0.900179 -0.454946
C  -3.407877 -1.180329 0.584259
C  -1.93803 -1.411937 0.761014
C  -2.475398 0.011247 0.594914
C  -4.27426 -1.314055 1.814386
C  -4.101584 -1.63772 -0.674771
C  -1.097898 -2.072169 -0.262111
C  -2.157682 0.820042 -0.595497
C  -0.49756 -3.258197 -0.115133
C  0.323364 -3.843587 -1.224141
C  -0.602322 -4.120437 1.105271
C  -1.278396 2.95866 -1.193916
C  0.226092 3.008386 -1.153596
C  0.978011 1.890524 -0.813665
C  0.874622 4.195871 -1.479462
C  2.363504 1.97538 -0.769489
C  2.259691 4.258791 -1.463879
C  3.015007 3.155242 -1.097219
C  2.742768 -0.00995 0.483798
C  2.084526 0.360932 1.651219
C  3.079159 -1.337385 0.255153
C  1.753188 -0.613229 2.581536
C  2.757526 -2.297554 1.203773
C  2.086133 -1.943791 2.365827
H  -1.635326 -1.606708 1.78507
H  -2.478429 0.589655 1.511303
H  -4.565518 -2.355306 1.967484
H  -5.188881 -0.725293 1.715378
H  -3.75989 -0.978801 2.716192
H  -3.455611 -1.680898 -1.546754
H  -4.945496 -0.987847 -0.914319
H  -4.499611 -2.642291 -0.516873
H  -0.970074 -1.567256 -1.212394
H  -0.085666 -4.804287 -1.549591
H  1.346807 -4.041782 -0.89465
H  0.371204 -3.187717 -2.093462
H  -1.204536 -5.008254 0.891009
H  -1.054571 -3.620712 1.960216
H  0.380736 -4.485424 1.411381
H  -1.689972 3.936273 -0.942034
H  -1.632211 2.704098 -2.194797
H  0.503013 0.948261 -0.573642
H  0.296713 5.074595 -1.739086
H  2.759666 5.184502 -1.71788
H  4.095841 3.207908 -1.06318
H  1.832251 1.396179 1.843143
H  3.595239 -1.613855 -0.655939
H  1.237225 -0.322364 3.487643
H  3.027444 -3.330497 1.025159
H  1.828625 -2.696323 3.099278
elementType: O C H
totalener: -1117.86564140 hartree
nucrepener: 2367.69644855 hartree
electener: -3485.56208994 hartree
oneelecener: -6225.26387259 hartree
twoeener: 2739.70178265 hartree
cpcmener: -0.02546018 hartree
kineticenergy: 1112.79245695 hartree
xcener: -110.230104128751 hartree
chargesum: -0.0000000
charge: -0.288490 -0.461193 -0.326703 0.167793 -0.020537 -0.105629 -0.265846 -0.293548 -0.290089 0.369045 -0.038425 -0.231101 -0.272128 0.080959 0.034085 -0.205824 -0.238610 0.286842 -0.104386 -0.259353 0.322591 -0.198530 -0.267573 -0.151690 -0.121488 -0.187696 0.109641 0.097010 0.093536 0.094119 0.087134 0.098213 0.102578 0.093809 0.129234 0.103897 0.087289 0.092206 0.113983 0.094459 0.087860 0.119153 0.112178 0.136593 0.139931 0.156692 0.144400 0.153384 0.144530 0.157614 0.160761 0.157322
qa: -0.2885 -0.4612 -0.3267 0.1678 -0.0205 -0.1056 -0.2658 -0.2935 -0.2901 0.3690 -0.0384 -0.2311 -0.2721 0.0810 0.0341 -0.2058 -0.2386 0.2868 -0.1044 -0.2594 0.3226 -0.1985 -0.2676 -0.1517 -0.1215 -0.1877 0.1096 0.0970 0.0935 0.0941 0.0871 0.0982 0.1026 0.0938 0.1292 0.1039 0.0873 0.0922 0.1140 0.0945 0.0879 0.1192 0.1122 0.1366 0.1399 0.1567 0.1444 0.1534 0.1445 0.1576 0.1608 0.1573
va: 2.1190 2.0280 2.0873 3.7316 3.7663 3.9371 3.9001 3.9069 3.7635 4.1494 3.7223 3.9114 3.9371 3.8370 3.6770 3.9379 3.9709 3.7482 3.8873 4.0084 3.6516 3.8917 3.9865 3.8696 3.8117 3.8528 1.0026 1.0298 1.0026 1.0024 1.0047 1.0137 1.0003 1.0018 1.0195 0.9983 0.9974 1.0073 0.9994 1.0066 0.9978 0.9956 1.0167 0.9934 1.0032 0.9890 1.0081 0.9970 1.0096 0.9912 0.9865 0.9904
dispcorr: -0.029233129 hartree
energy: -1117.894874524365
dipole: -15.14406 14.74476 -0.39931 -21.37468 21.40209 0.02741 5.56091 -4.32927 1.23164
magnitude: 1.29504 au
magnitude: 3.29174 debye
