program: Gaussian 09
title: 000068273
version: EM64L-G09RevD.01
frameworkgroup: C1[X(C16H14O3)]
method: RPBEPBE
basis: SDD
operation: Freq
keyword: #pfreq=noraman
keyword: PBEPBE/SDD
title: #p freq=noraman PBEPBE/SDD
converged: YES YES NO NO
title: Mulliken charges:
elementType: O O O C C C C C C C C C C C C C C C C H H H H H H H H H H H H H H
charge: -0.337196 -0.285644 -0.214051 0.297300 0.159168 0.474377 -0.303894 -0.322926 -0.234175 -0.219656 -0.363965 -0.379260 -0.236003 -0.234648 -0.232751 -0.346976 -0.230432 0.186012 -0.518983 0.265017 0.253101 0.229861 0.229947 0.229810 0.238068 0.257909 0.231438 0.233722 0.243746 0.235025 0.231910 0.248456 0.215695
chargesum: 0.00000
title: Mulliken charges with hydrogens summed into heavy atoms:
elementType: O O O C C C C C C C C C C C C C C C C
charge: -0.337196 -0.285644 -0.214051 0.297300 0.159168 0.474377 -0.038877 -0.069825 -0.004314 0.010291 -0.134156 -0.141192 0.021906 -0.003210 0.000972 -0.103230 0.004593 0.186012 0.177078
polarizability: 3.65242337e+02 1.50090954e+01 1.81326262e+02 -5.63202608e-01 5.72392440e+00 9.04817532e+01
1716.lowfreq: -16.2507 -1.1953 -0.0005 -0.0002 0.0008 2.0206 15.7479 20.5005 29.5939
frequency: 13.3022 16.5274 29.2548 40.9253 54.7220 91.8238 102.8076 125.3871 149.8812 179.3001 190.5145 237.9599 259.5334 277.5636 305.4487 334.1526 402.3901 416.4361 457.4939 473.7739 488.1749 538.6197 550.2658 560.3172 598.5883 615.6554 659.5555 692.7789 696.6710 708.8722 749.8076 762.5185 774.3998 785.3487 845.2562 847.6445 857.0224 884.6813 929.3046 929.9359 937.8812 961.0386 975.2247 981.0159 988.7209 998.3862 1011.9463 1025.5770 1034.9746 1077.5378 1085.0626 1091.8102 1108.7219 1152.6964 1158.1455 1172.7733 1175.2290 1192.1721 1218.6657 1228.9861 1261.3493 1297.8969 1303.7068 1337.2283 1373.6491 1388.1675 1419.6322 1439.6597 1441.9994 1453.5171 1474.6619 1479.9533 1485.6662 1581.8640 1585.7940 1599.3137 1608.6884 1630.7089 1647.7999 2975.4551 3080.5462 3101.3588 3124.5109 3125.7580 3130.7709 3137.9403 3142.6363 3153.7660 3155.6966 3162.9133 3169.0161 3171.0714 3187.9647
redmass: 2.2581 3.3387 3.3410 4.9992 5.7110 5.5944 3.2588 2.4894 2.8912 4.0093 3.9331 4.8765 7.7685 2.9164 6.7252 4.2686 2.7491 5.7852 3.9289 4.3903 2.8644 5.3436 6.8192 3.8617 6.9935 6.4407 5.4172 4.5911 1.7688 5.4395 3.3316 1.5062 1.9070 5.4902 4.1475 1.2839 1.5863 1.8012 1.4401 4.5500 1.4980 8.4214 1.3204 1.3863 6.1873 1.3033 1.2328 2.2222 2.0390 3.3004 1.6816 2.6118 1.2516 1.3187 1.6265 1.3106 1.0681 1.1309 1.5931 3.3430 1.4886 2.2257 1.4794 1.2748 10.5605 7.0630 1.3903 1.9946 2.0227 1.0656 2.4016 1.0704 2.3080 5.6975 7.3248 6.4648 6.1513 9.0184 6.6075 1.0338 1.0985 1.0899 1.1039 1.0868 1.0868 1.0859 1.0916 1.0965 1.0914 1.0915 1.1015 1.0970 1.0969
irintensity: 2.3413 0.4344 1.9853 0.3098 0.0711 0.2464 0.2976 7.1277 0.3316 3.0748 1.7977 2.3640 7.3097 1.0602 1.4472 3.2274 0.0289 13.9366 5.4551 3.3653 10.0304 2.8139 25.8203 4.3768 3.6312 0.0918 1.9993 13.0344 37.9917 3.5234 12.9029 75.6832 74.2782 17.3696 38.2882 0.4638 1.4632 10.6586 0.0244 134.4255 20.7938 37.8509 0.6353 0.4299 6.6436 9.7882 34.5966 1.7993 18.2328 694.9489 28.1652 127.8736 16.1483 2.3055 39.1026 30.2323 1.5633 12.8878 32.2532 148.1155 3.6399 50.5942 48.2451 16.9379 3.1443 16.3022 10.5991 23.8004 13.2931 10.4987 141.5218 5.6614 13.8836 11.6557 14.5902 28.3788 48.2005 285.4939 98.0703 72.7721 36.9018 2.0539 22.1385 4.9537 0.8449 2.3670 8.2447 31.2197 18.9794 8.1723 32.9997 19.9838 3.4281
temp: 298.150 k
press: 1.00000 atm
elementType: 8 8 8 6 6 6 6 6 6 6 6 6 6 6 6 6 6 6 6 1 1 1 1 1 1 1 1 1 1 1 1 1 1
symmnumber: 1
zpe: 668962.8 jmol-1
zpe.correction: 0.254794 hartree
zpe.thermalcorrener: 0.272289 hartree
zpe.thermalcorrenthalpy: 0.273233 hartree
zpe.thermalcorrgfe: 0.205168 hartree
zpe.sumelectzpe: -842.400397 hartree
zpe.sumelectthermal: -842.382902 hartree
zpe.sumelectthermalent: -842.381958 hartree
zpe.sumelectthermalfe: -842.450024 hartree
dipole: 3.1909 1.7199 2.0520
dipole: 4.1654
quadrupole: -83.9514 -102.2724 -116.8521
quadrupole: 1.6153 -4.7091 2.4757
quadrupole: 17.0739 -1.2471 -15.8268 1.6153 -4.7091 2.4757
hfenergy: -842.6551915 hartree
pointgroup: C01 [X(C16H14O3)]
dipole: -1.2544451 -0.6174227 0.8548688 debye
polarizability: 365.3175082|14.4690856|180.0676656|-1.3341456|-11.8070503|91.6651781 unknown
InChI: InChI=1S/C16H14O3/c1-18-14-9-5-6-10-15(14)19-16(17)12-11-13-7-3-2-4-8-13/h2-12H,1H3
charge 0 multiplicity 1
33 atoms
O  1.405404 -0.170585 0.306223
O  3.277704 -2.115361 -0.681135
O  0.610103 1.824537 -0.6909
C  2.785438 0.175702 0.197122
C  3.679111 -0.839697 -0.24599
C  -3.459368 0.263708 -0.084694
C  3.268335 1.451237 0.561785
C  5.057737 -0.537157 -0.346163
C  4.646887 1.735129 0.459964
C  5.541743 0.742827 -0.003767
C  -3.784461 -0.992142 0.508575
C  -4.525853 1.099452 -0.526593
C  -2.081855 0.737274 -0.261141
C  -5.126467 -1.391636 0.651815
C  -5.870186 0.699236 -0.382884
C  -0.927627 0.092639 0.097357
C  -6.175886 -0.54877 0.20735
C  0.381236 0.715744 -0.16011
C  2.473898 -2.936551 0.247322
H  2.566119 2.218198 0.896019
H  5.72597 -1.327992 -0.700804
H  5.014995 2.72866 0.73529
H  6.611476 0.960681 -0.090558
H  -2.986055 -1.656107 0.857534
H  -4.289527 2.067731 -0.984456
H  -1.960785 1.722018 -0.736925
H  -5.361498 -2.359076 1.108892
H  -6.676071 1.355229 -0.728949
H  -0.9153 -0.890376 0.576857
H  -7.218916 -0.863915 0.320715
H  2.345583 -3.900644 -0.26791
H  1.494871 -2.471613 0.448244
H  3.020348 -3.088379 1.198218
