program: Orca
programVersion: 5.0.2
elementType: O O O C C C C C C C C C C C C C C C C C C C C C C C H H H H H H H H H H H H H H H H H H H H H H H H H H
charge: 0
multiplicity: 1
keywords: wb97x-d3
keywords: def2-TZVPP
keywords: def2/J RIJCOSX
keywords: DEFGRID2
keywords: scfconv7
keywords: smallprint printgap noloewdin
keywords: NOSOSCF
formula: C23H26O3
InChI: InChI=1/C23H26O3/c1-16(2)13-20-21(23(20,3)4)22(24)25-15-17-9-8-12-19(14-17)26-18-10-6-5-7-11-18/h5-14,20-21H,15H2,1-4H3
52 atoms
O  -1.602216 1.836221 1.331833
O  -2.596825 1.567783 -0.646705
O  2.599265 0.154405 -0.953194
C  -3.761871 -1.082499 0.448461
C  -2.31389 -1.448381 0.310059
C  -2.727756 -0.153739 1.031076
C  -4.551332 -1.857123 1.478969
C  -4.590279 -0.717211 -0.759089
C  -1.582886 -1.417185 -0.969075
C  -2.34104 1.145367 0.45443
C  -0.638557 -2.296164 -1.322506
C  0.052395 -2.184988 -2.647032
C  -0.213727 -3.449445 -0.451198
C  -0.977486 3.025554 0.864797
C  0.150165 2.747437 -0.093973
C  0.848147 1.545725 -0.049374
C  0.523763 3.726294 -1.008814
C  1.917208 1.338628 -0.911853
C  1.591976 3.505786 -1.864914
C  2.299374 2.313975 -1.820672
C  2.929779 -0.516307 0.189987
C  3.236274 0.125836 1.384467
C  3.012891 -1.899469 0.093289
C  3.604015 -0.633628 2.486527
C  3.391311 -2.643729 1.200472
C  3.681244 -2.017079 2.404713
H  -1.970298 -2.207061 1.004898
H  -2.611895 -0.195202 2.108253
H  -4.926838 -2.790564 1.054879
H  -5.411426 -1.280097 1.825679
H  -3.948358 -2.109826 2.352563
H  -5.077267 -1.616213 -1.142472
H  -4.025038 -0.281464 -1.576931
H  -5.377954 -0.011947 -0.487231
H  -1.826066 -0.628549 -1.671338
H  -0.305498 -1.335446 -3.229135
H  -0.092731 -3.089241 -3.244708
H  1.132488 -2.073139 -2.519019
H  -1.02397 -4.167605 -0.306654
H  0.107878 -3.127119 0.540755
H  0.617725 -3.995102 -0.897049
H  -0.592302 3.50706 1.764804
H  -1.706306 3.705826 0.418787
H  0.564886 0.769173 0.650476
H  -0.024902 4.659078 -1.057161
H  1.878234 4.268573 -2.577382
H  3.132254 2.136256 -2.489078
H  3.195672 1.204545 1.465657
H  2.785723 -2.387555 -0.846298
H  3.839765 -0.131162 3.415938
H  3.451921 -3.721387 1.118235
H  3.969982 -2.6000 3.269312
elementType: O C H
totalener: -1117.86515008 hartree
nucrepener: 2365.82332482 hartree
electener: -3483.68847490 hartree
oneelecener: -6221.71679683 hartree
twoeener: 2738.02832193 hartree
cpcmener: -0.02588346 hartree
kineticenergy: 1112.80134594 hartree
xcener: -110.230537339129 hartree
chargesum: -0.0000000
charge: -0.296657 -0.452673 -0.333955 0.116035 0.068322 -0.101119 -0.265867 -0.282923 -0.338417 0.369935 -0.015715 -0.224807 -0.313464 0.093893 0.048480 -0.263488 -0.241320 0.332701 -0.102074 -0.274907 0.327337 -0.212724 -0.294572 -0.142825 -0.114666 -0.190318 0.109426 0.097253 0.094743 0.093954 0.086734 0.092843 0.096287 0.100085 0.119849 0.089987 0.107704 0.083182 0.122324 0.099130 0.100050 0.121827 0.114656 0.144023 0.140098 0.156185 0.146023 0.153708 0.162984 0.158572 0.157070 0.157092
qa: -0.2967 -0.4527 -0.3340 0.1160 0.0683 -0.1011 -0.2659 -0.2829 -0.3384 0.3699 -0.0157 -0.2248 -0.3135 0.0939 0.0485 -0.2635 -0.2413 0.3327 -0.1021 -0.2749 0.3273 -0.2127 -0.2946 -0.1428 -0.1147 -0.1903 0.1094 0.0973 0.0947 0.0940 0.0867 0.0928 0.0963 0.1001 0.1198 0.0900 0.1077 0.0832 0.1223 0.0991 0.1000 0.1218 0.1147 0.1440 0.1401 0.1562 0.1460 0.1537 0.1630 0.1586 0.1571 0.1571
va: 2.1048 2.0430 2.0514 3.7513 3.7270 3.8461 3.9060 3.8983 3.8671 4.1472 3.6661 3.9065 3.9463 3.8088 3.6390 3.9344 3.9983 3.5964 3.8820 4.0518 3.6870 3.9216 3.9514 3.8936 3.8768 3.9194 0.9997 1.0293 1.0023 1.0022 1.0045 1.0012 1.0132 1.0000 1.0212 1.0096 0.9946 1.0031 0.9972 0.9912 1.0034 0.9914 1.0116 1.0162 1.0027 0.9889 1.0070 0.9973 0.9926 0.9900 0.9917 0.9904
dispcorr: -0.028488293 hartree
energy: -1117.893638370480
dipole: -13.56602 13.80124 0.23522 -16.72309 16.35074 -0.37235 -0.99569 2.26174 1.26604
magnitude: 1.34046 au
magnitude: 3.40718 debye
