program: Gaussian 09
title: 000068193
version: EM64L-G09RevD.01
frameworkgroup: C1[X(C6H4I2O4S)]
method: RPBEPBE
basis: SDD
operation: Freq
keyword: #p
keyword: freq=noraman
keyword: PBEPBE/SDD
title: #p freq=noraman PBEPBE/SDD
converged: YES YES NO NO
title: Mulliken charges:
elementType: I I S O O O O C C C C C C H H H H
charge: 0.173995 0.197641 0.996314 -0.563041 -0.375369 -0.495651 -0.493552 -0.082753 -0.164562 -0.172275 -0.487089 -0.473810 0.594614 0.303328 0.302472 0.386395 0.353342
chargesum: 0.00000
title: Mulliken charges with hydrogens summed into heavy atoms:
elementType: I I S O O O O C C C C C C
charge: 0.173995 0.197641 0.996314 -0.176646 -0.022027 -0.495651 -0.493552 -0.082753 0.138766 0.130197 -0.487089 -0.473810 0.594614
polarizability: 2.10202813e+02 1.49672407e+00 1.93861733e+02 -4.87131366e-02 -1.38279357e+00 6.55707546e+01
1716.lowfreq: -5.0724 -4.3440 -0.0008 0.0010 0.0012 2.6235 22.9682 67.7231 77.3810
frequency: 22.8909 67.7207 77.3808 81.8176 91.2532 158.5059 167.2853 185.1528 191.9142 205.7876 240.8267 257.2187 296.0283 307.7478 370.9277 384.0590 414.3069 461.5451 490.9241 521.4583 530.8993 582.9389 641.9738 678.7980 745.4540 805.4845 836.6798 891.1650 903.7956 969.5095 1016.3336 1048.7464 1080.2537 1125.9405 1222.8340 1272.6957 1372.9152 1381.6402 1428.8790 1553.6436 1564.5219 3171.7239 3174.9887 3434.6014 3478.7923
redmass: 9.7082 10.8412 16.9082 7.6690 32.0520 2.7371 18.7155 4.1847 9.3483 2.2431 7.9808 9.9607 4.7894 10.3363 8.4022 8.3659 11.9916 1.2337 3.3732 4.8767 9.0990 5.2049 11.2761 9.3709 6.5371 6.9236 12.4920 1.4038 1.3900 19.0763 8.0725 1.1706 2.2238 1.4999 1.5387 2.0057 3.3516 7.4830 3.5720 8.0990 8.0277 1.0931 1.0938 1.0649 1.0661
irintensity: 1.5910 0.1881 0.3840 0.1470 0.3099 26.1056 1.4816 8.6652 0.8230 34.2364 2.3685 10.0362 64.0094 22.2432 1.4103 3.2046 107.4111 106.7150 22.5046 15.7054 109.9513 56.1556 19.5858 59.8283 18.5915 12.4886 83.2825 16.5577 8.4714 69.4012 23.3297 78.5414 98.0208 182.3760 85.7897 24.0538 108.5871 15.7859 71.2893 24.7292 14.9627 8.1453 12.4763 93.1825 50.4280
temp: 298.150 k
press: 1.00000 atm
elementType: 53 53 16 8 8 8 8 6 6 6 6 6 6 1 1 1 1
symmnumber: 1
zpe: 238714.6 jmol-1
zpe.correction: 0.090922 hartree
zpe.thermalcorrener: 0.105359 hartree
zpe.thermalcorrenthalpy: 0.106303 hartree
zpe.thermalcorrgfe: 0.045701 hartree
zpe.sumelectzpe: -951.856403 hartree
zpe.sumelectthermal: -951.841966 hartree
zpe.sumelectthermalent: -951.841022 hartree
zpe.sumelectthermalfe: -951.901623 hartree
dipole: 1.6239 -3.0826 1.4749
dipole: 3.7835
quadrupole: -106.4354 -115.1366 -116.2844
quadrupole: -5.0599 -0.0913 10.5794
quadrupole: 6.1834 -2.5178 -3.6657 -5.0599 -0.0913 10.5794
hfenergy: -951.9473246 hartree
pointgroup: C01 [X(C6H4I2O4S1)]
dipole: 1.2415053 0.6203085 0.5381628 debye
dipolederiv: -0.1592246 -0.1672957 0.0047238 -0.181738 -0.3994184 0.0148828 0.0015795 0.0130442 0.0755556 -0.0609655 0.1912001 -0.0037286 0.2485244 -0.323829 0.0092545 -0.0090816 0.0112642 0.0753864 2.3154429 -0.0113008 -0.0907628 -0.0280979 1.1205613 0.0118872 -0.2450416 0.0118715 1.6478022 -0.5866422 0.009694 0.2384368 0.0124492 -0.5323997 -0.0116381 0.3652011 -0.0138884 -0.9863133 -1.3425017 -0.1567889 0.0034907 -0.0150376 -0.1678558 -0.0045374 -0.0049832 -0.006517 -0.3675921 -0.7532071 0.0636257 -0.0154645 0.116876 -0.564789 0.1160615 -0.0062518 0.0349712 -0.5085521 -0.7558051 -0.0586848 -0.0184734 -0.1078769 -0.5627275 -0.111354 0.0017728 -0.0294773 -0.5009427 -0.3928098 -0.0401446 -0.0127296 0.0075495 -0.1066633 -0.000577 -0.1570595 -0.0003101 -0.1609802 -0.1221234 0.1193833 0.0019523 -0.1087321 -0.231396 0.0044916 0.0180239 0.0177865 -0.0114633 -0.1289405 0.0015772 0.0041554 0.0976477 -0.2738024 0.0086239 0.0105695 -0.0044511 0.0013396 0.0463457 0.4098936 -0.0091541 0.719426 0.8411692 -0.0304655 -0.0124859 -0.0265617 -0.1965684 -0.004459 -0.4205421 0.0122906 -0.7119082 0.8795629 -0.025701 0.0264328 -0.0301359 -0.1903303 1.0963042 0.0906165 0.0036555 0.022019 -0.5041426 0.0179336 0.0072802 0.0187265 0.1837527 0.1484162 -0.0584207 -0.0061143 -0.0110167 0.0945075 0.0039501 -0.0071924 -0.0061185 0.1531489 0.1581354 0.0510594 -0.0093756 0.0088825 0.0933692 -0.0005007 -0.0067558 0.0105646 0.1551871 0.108106 -0.0027484 -0.102947 0.0000805 0.3493035 -0.0023678 0.0147534 -0.0020228 0.2706634 0.4339287 -0.021124 0.000045 -0.0690475 0.2885502 0.0000562 0.0032385 0.001254 0.3599064 unknown
polarizability: 193.7943032|-1.0891114|210.1676803|-1.2825792|-3.8790923|65.6733175 unknown
InChI: InChI=1S/C6H4I2O4S/c7-4-1-3(13(10,11)12)2-5(8)6(4)9/h1-2,9-10H
charge 0 multiplicity 1
17 atoms
I  2.491722 3.089576 -0.106379
I  2.379634 -3.065195 0.058033
S  -2.569287 0.099362 -0.074423
O  -2.780114 0.147309 1.769591
O  3.459046 -0.081684 -0.003025
O  -3.080524 1.505035 -0.689539
O  -3.142893 -1.309349 -0.623726
C  -0.705052 0.064055 -0.043194
C  -0.066534 -1.186114 -0.003439
C  -0.028866 1.29306 -0.070753
C  1.376036 1.250354 -0.060692
C  1.339878 -1.204876 0.005541
C  2.083162 0.011721 -0.017385
H  -0.651445 -2.10992 0.003622
H  -0.583168 2.234199 -0.114817
H  -3.762657 0.148982 1.965029
H  3.885064 0.819787 -0.024144
