program: Orca
programVersion: 5.0.2
elementType: O O O C C C C C C C C C C C C C C C C C C C C C C C H H H H H H H H H H H H H H H H H H H H H H H H H H
charge: 0
multiplicity: 1
keywords: wb97x-d3
keywords: def2-TZVPP
keywords: def2/J RIJCOSX
keywords: DEFGRID2
keywords: scfconv7
keywords: smallprint printgap noloewdin
keywords: NOSOSCF
formula: C23H26O3
InChI: InChI=1/C23H26O3/c1-16(2)13-20-21(23(20,3)4)22(24)25-15-17-9-8-12-19(14-17)26-18-10-6-5-7-11-18/h5-14,20-21H,15H2,1-4H3
52 atoms
O  -2.329632 2.11833 -0.514315
O  -2.053572 0.260116 -1.721612
O  2.2635 0.908102 1.069237
C  -4.328592 -0.935205 0.054678
C  -3.070715 -1.17607 0.818121
C  -3.384583 0.229008 0.279226
C  -5.607834 -0.859716 0.856373
C  -4.540362 -1.528221 -1.316143
C  -1.956078 -1.998007 0.297434
C  -2.538856 0.819033 -0.768156
C  -0.809744 -2.239554 0.942182
C  0.224879 -3.15439 0.360189
C  -0.442993 -1.643842 2.266201
C  -1.4865 2.842272 -1.396907
C  -0.02087 2.5411 -1.226818
C  0.473084 1.809716 -0.154205
C  0.867377 3.051816 -2.169113
C  1.839619 1.59956 -0.033084
C  2.230677 2.847461 -2.027957
C  2.732542 2.123129 -0.95697
C  3.176117 -0.100791 0.94764
C  3.301627 -0.877656 -0.198494
C  3.953422 -0.366809 2.068114
C  4.225739 -1.913722 -0.216217
C  4.863552 -1.412342 2.037873
C  5.009827 -2.187632 0.89534
H  -3.196047 -1.219625 1.895329
H  -3.703431 0.941302 1.031155
H  -6.353345 -0.244923 0.347969
H  -5.445225 -0.432638 1.847051
H  -6.034815 -1.855617 0.991654
H  -4.968056 -2.528076 -1.217772
H  -3.637975 -1.615396 -1.913781
H  -5.251304 -0.92441 -1.883419
H  -2.100493 -2.475662 -0.665696
H  0.411878 -4.005276 1.021303
H  1.182876 -2.641312 0.243001
H  -0.069755 -3.545071 -0.613912
H  -1.188925 -0.955951 2.66046
H  0.499004 -1.095391 2.187186
H  -0.278736 -2.425739 3.012649
H  -1.672707 3.890904 -1.159934
H  -1.786834 2.689051 -2.436359
H  -0.181617 1.398094 0.604781
H  0.492166 3.615563 -3.015112
H  2.914991 3.256495 -2.760012
H  3.799116 1.970347 -0.850819
H  2.688147 -0.691638 -1.070626
H  3.841646 0.241695 2.956936
H  4.322219 -2.516123 -1.110422
H  5.466005 -1.615962 2.913779
H  5.725637 -2.998713 0.872481
elementType: O C H
totalener: -1117.86722080 hartree
nucrepener: 2325.90197047 hartree
electener: -3443.76919127 hartree
oneelecener: -6141.99987005 hartree
twoeener: 2698.23067878 hartree
cpcmener: -0.02596998 hartree
kineticenergy: 1112.79995220 hartree
xcener: -110.230645230595 hartree
chargesum: -0.0000000
charge: -0.300353 -0.457962 -0.329459 0.130830 -0.028066 -0.063178 -0.257091 -0.296280 -0.244912 0.357752 -0.037528 -0.216354 -0.269432 0.082702 0.034451 -0.246447 -0.218492 0.251992 -0.134389 -0.196910 0.292407 -0.197372 -0.258128 -0.145911 -0.111367 -0.188326 0.108016 0.092054 0.095110 0.086494 0.094997 0.100477 0.093993 0.100003 0.121271 0.097682 0.074239 0.090130 0.091741 0.084210 0.106666 0.129062 0.116274 0.136397 0.141610 0.157893 0.153759 0.159336 0.143831 0.158473 0.156843 0.157263
qa: -0.3004 -0.4580 -0.3295 0.1308 -0.0281 -0.0632 -0.2571 -0.2963 -0.2449 0.3578 -0.0375 -0.2164 -0.2694 0.0827 0.0345 -0.2464 -0.2185 0.2520 -0.1344 -0.1969 0.2924 -0.1974 -0.2581 -0.1459 -0.1114 -0.1883 0.1080 0.0921 0.0951 0.0865 0.0950 0.1005 0.0940 0.1000 0.1213 0.0977 0.0742 0.0901 0.0917 0.0842 0.1067 0.1291 0.1163 0.1364 0.1416 0.1579 0.1538 0.1593 0.1438 0.1585 0.1568 0.1573
va: 2.1117 2.0270 2.0338 3.7863 3.7830 3.8352 3.8890 3.8940 3.8459 4.1166 3.7241 3.9227 3.9448 3.8205 3.6574 4.0355 3.9714 3.7824 3.8955 3.9329 3.5921 3.8418 4.0041 3.8829 3.8805 3.9029 1.0030 1.0314 1.0027 1.0048 1.0024 0.9990 1.0202 0.9997 1.0060 0.9982 1.0027 1.0105 1.0090 1.0029 0.9995 0.9906 1.0113 1.0192 1.0009 0.9903 0.9982 0.9990 1.0095 0.9909 0.9890 0.9905
dispcorr: -0.027584824 hartree
energy: -1117.894805624826
dipole: -14.21903 14.07260 -0.14643 -15.19704 15.49059 0.29355 3.52010 -3.16180 0.35830
magnitude: 0.48579 au
magnitude: 1.23478 debye
