program: Orca
programVersion: 5.0.2
elementType: O O O C C C C C C C C C C C C C C C C C C C C C C C H H H H H H H H H H H H H H H H H H H H H H H H H H
charge: 0
multiplicity: 1
keywords: wb97x-d3
keywords: def2-TZVPP
keywords: def2/J RIJCOSX
keywords: DEFGRID2
keywords: scfconv7
keywords: smallprint printgap noloewdin
keywords: NOSOSCF
formula: C23H26O3
InChI: InChI=1/C23H26O3/c1-16(2)13-20-21(23(20,3)4)22(24)25-15-17-9-8-12-19(14-17)26-18-10-6-5-7-11-18/h5-14,20-21H,15H2,1-4H3
52 atoms
O  -1.065825 1.776998 0.708406
O  -1.332783 -0.428862 0.893656
O  3.590961 -0.933866 -2.001001
C  -4.229876 0.235636 -0.119174
C  -4.355237 0.198037 1.372434
C  -3.245347 1.025782 0.726321
C  -5.232703 1.076333 -0.872982
C  -3.795014 -0.986734 -0.888396
C  -4.094856 -1.007235 2.182635
C  -1.817261 0.672659 0.793484
C  -4.860185 -1.455401 3.184918
C  -4.473001 -2.690618 3.943445
C  -6.127921 -0.815503 3.664777
C  0.345286 1.60446 0.64538
C  0.807764 1.049916 -0.675041
C  1.979944 0.305807 -0.712683
C  0.116295 1.304579 -1.85615
C  2.465192 -0.161061 -1.927548
C  0.597981 0.809003 -3.058258
C  1.778791 0.082852 -3.106784
C  4.716594 -0.574799 -1.313692
C  5.513547 -1.605375 -0.833228
C  5.095752 0.751584 -1.141445
C  6.698139 -1.304974 -0.17695
C  6.27775 1.036238 -0.472521
C  7.083522 0.015172 0.012595
H  -5.137821 0.839334 1.76222
H  -3.419206 2.095396 0.739374
H  -5.539457 1.95512 -0.303787
H  -6.130609 0.496195 -1.09638
H  -4.817264 1.422842 -1.821754
H  -3.131532 -1.649325 -0.340133
H  -3.287396 -0.699893 -1.811696
H  -4.675927 -1.568222 -1.167802
H  -3.206934 -1.580518 1.947103
H  -4.365503 -2.477309 5.010758
H  -3.532795 -3.115153 3.591451
H  -5.243089 -3.462578 3.861311
H  -6.478277 0.005639 3.042413
H  -6.006094 -0.431558 4.68153
H  -6.932006 -1.554306 3.71159
H  0.702882 0.986993 1.472378
H  0.750813 2.607054 0.789829
H  2.507553 0.085194 0.208557
H  -0.799114 1.882354 -1.848902
H  0.055224 1.002289 -3.97453
H  2.160821 -0.295639 -4.046453
H  5.208364 -2.634342 -0.977839
H  4.485416 1.559445 -1.52513
H  7.317636 -2.111246 0.194257
H  6.57083 2.069499 -0.337287
H  8.004534 0.246506 0.531238
elementType: O C H
totalener: -1117.86729645 hartree
nucrepener: 2180.34195582 hartree
electener: -3298.20925227 hartree
oneelecener: -5850.57357048 hartree
twoeener: 2552.36431821 hartree
cpcmener: -0.02605262 hartree
kineticenergy: 1112.79928518 hartree
xcener: -110.228279030260 hartree
chargesum: 0.0000000
charge: -0.297470 -0.461806 -0.330229 0.106417 0.027622 -0.077136 -0.261500 -0.280942 -0.299640 0.374385 -0.045484 -0.220481 -0.258818 0.102770 0.046769 -0.207047 -0.250419 0.256243 -0.113513 -0.245800 0.279945 -0.249190 -0.184549 -0.122373 -0.151365 -0.188356 0.114826 0.095390 0.087141 0.094293 0.092867 0.096422 0.097944 0.099031 0.124228 0.091405 0.088643 0.092659 0.088355 0.098968 0.093198 0.113981 0.121335 0.141829 0.141626 0.156780 0.145586 0.145606 0.154978 0.158060 0.158954 0.157861
qa: -0.2975 -0.4618 -0.3302 0.1064 0.0276 -0.0771 -0.2615 -0.2809 -0.2996 0.3744 -0.0455 -0.2205 -0.2588 0.1028 0.0468 -0.2070 -0.2504 0.2562 -0.1135 -0.2458 0.2799 -0.2492 -0.1845 -0.1224 -0.1514 -0.1884 0.1148 0.0954 0.0871 0.0943 0.0929 0.0964 0.0979 0.0990 0.1242 0.0914 0.0886 0.0927 0.0884 0.0990 0.0932 0.1140 0.1213 0.1418 0.1416 0.1568 0.1456 0.1456 0.1550 0.1581 0.1590 0.1579
va: 2.1135 2.0281 2.0714 3.7122 3.7637 3.8493 3.9101 3.9070 3.8594 4.1164 3.7709 3.9238 3.9408 3.8059 3.6089 3.9761 3.9536 3.7304 3.8943 4.0233 3.7029 4.0012 3.8910 3.8888 3.8994 3.9049 1.0042 1.0304 1.0052 1.0018 1.0028 1.0138 1.0014 1.0016 1.0254 0.9958 1.0089 0.9968 1.0124 0.9958 0.9977 1.0129 0.9908 1.0069 1.0136 0.9895 1.0061 1.0085 0.9981 0.9889 0.9906 0.9905
dispcorr: -0.023402002 hartree
energy: -1117.890698455186
dipole: -32.67853 32.04710 -0.63144 -3.84754 5.11428 1.26674 11.63421 -11.41087 0.22334
magnitude: 1.43291 au
magnitude: 3.64217 debye
