program: Orca
programVersion: 5.0.2
elementType: O O O C C C C C C C C C C C C C C C C C C C C C C C H H H H H H H H H H H H H H H H H H H H H H H H H H
charge: 0
multiplicity: 1
keywords: wb97x-d3
keywords: def2-TZVPP
keywords: def2/J RIJCOSX
keywords: DEFGRID2
keywords: scfconv7
keywords: smallprint printgap noloewdin
keywords: NOSOSCF
formula: C23H26O3
InChI: InChI=1/C23H26O3/c1-16(2)13-20-21(23(20,3)4)22(24)25-15-17-9-8-12-19(14-17)26-18-10-6-5-7-11-18/h5-14,20-21H,15H2,1-4H3
52 atoms
O  -1.731731 1.103704 -0.461378
O  -3.8453 1.715691 -0.12885
O  3.321811 0.831237 -0.046281
C  -2.705755 -1.729051 -0.980617
C  -2.532642 -1.648895 0.496883
C  -3.368684 -0.588904 -0.229152
C  -3.672073 -2.762589 -1.513253
C  -1.535364 -1.503061 -1.906563
C  -1.227167 -1.359629 1.138408
C  -3.01747 0.841711 -0.269909
C  -1.094739 -0.807871 2.34722
C  0.250765 -0.609777 2.971847
C  -2.281146 -0.357736 3.153821
C  -1.319481 2.469175 -0.422403
C  0.145469 2.53639 -0.740973
C  1.036459 1.59027 -0.241836
C  0.622065 3.597428 -1.502491
C  2.389153 1.700921 -0.534756
C  1.979781 3.711549 -1.763586
C  2.869477 2.759773 -1.294528
C  3.058356 -0.503452 0.084638
C  2.310869 -1.218064 -0.843821
C  3.637227 -1.146725 1.170905
C  2.134515 -2.582964 -0.663923
C  3.462967 -2.513353 1.330011
C  2.704842 -3.236967 0.419716
H  -3.166498 -2.318267 1.07504
H  -4.438648 -0.704043 -0.098658
H  -4.508253 -2.929725 -0.833162
H  -3.168424 -3.720488 -1.659903
H  -4.083759 -2.454091 -2.47648
H  -1.068161 -2.463126 -2.136463
H  -0.762016 -0.856396 -1.502161
H  -1.868487 -1.069759 -2.851612
H  -0.331595 -1.661362 0.602515
H  1.056385 -0.995796 2.347081
H  0.309483 -1.11133 3.942085
H  0.446729 0.449075 3.162235
H  -1.974373 0.172721 4.055428
H  -2.897231 -1.202771 3.472029
H  -2.934232 0.310925 2.589052
H  -1.512502 2.879758 0.573093
H  -1.886909 3.063905 -1.14113
H  0.677436 0.775165 0.375058
H  -0.067518 4.335838 -1.892845
H  2.347553 4.540528 -2.354228
H  3.928008 2.83443 -1.509578
H  1.870179 -0.725966 -1.701614
H  4.220624 -0.577336 1.883878
H  1.548521 -3.137946 -1.385367
H  3.916265 -3.010713 2.177858
H  2.563942 -4.301855 0.549782
elementType: O C H
totalener: -1117.86265489 hartree
nucrepener: 2392.74652326 hartree
electener: -3510.60917815 hartree
oneelecener: -6274.39927771 hartree
twoeener: 2763.79009956 hartree
cpcmener: -0.02452607 hartree
kineticenergy: 1112.79676443 hartree
xcener: -110.230938033572 hartree
chargesum: -0.0000000
charge: -0.262109 -0.479556 -0.326925 0.145353 -0.040657 -0.137579 -0.268754 -0.275915 -0.166244 0.406793 -0.076186 -0.175712 -0.263596 0.076406 0.017663 -0.186018 -0.222847 0.301619 -0.115964 -0.252756 0.303841 -0.205312 -0.248024 -0.129495 -0.107709 -0.196423 0.109405 0.091501 0.086711 0.092806 0.096445 0.100337 0.054572 0.107675 0.099578 0.022147 0.112595 0.099641 0.097133 0.104085 0.095607 0.119368 0.107553 0.074960 0.141069 0.157017 0.144256 0.159245 0.140958 0.158976 0.156123 0.156343
qa: -0.2621 -0.4796 -0.3269 0.1454 -0.0407 -0.1376 -0.2688 -0.2759 -0.1662 0.4068 -0.0762 -0.1757 -0.2636 0.0764 0.0177 -0.1860 -0.2228 0.3016 -0.1160 -0.2528 0.3038 -0.2053 -0.2480 -0.1295 -0.1077 -0.1964 0.1094 0.0915 0.0867 0.0928 0.0964 0.1003 0.0546 0.1077 0.0996 0.0221 0.1126 0.0996 0.0971 0.1041 0.0956 0.1194 0.1076 0.0750 0.1411 0.1570 0.1443 0.1592 0.1410 0.1590 0.1561 0.1563
va: 2.1182 2.0245 2.0961 3.7309 3.7948 3.8704 3.9044 3.9204 3.6963 4.1215 3.7334 3.8790 3.9327 3.8048 3.7514 3.8774 3.9539 3.6952 3.9025 3.9982 3.6587 3.8505 3.9542 3.8259 3.8522 3.9069 1.0057 1.0308 1.0058 1.0021 1.0016 0.9979 1.0024 1.0058 0.9926 1.0406 0.9989 0.9992 1.0055 0.9959 1.0047 0.9926 1.0088 1.0445 1.0024 0.9893 1.0085 0.9918 1.0111 0.9926 0.9890 0.9916
dispcorr: -0.031523595 hartree
energy: -1117.894178487215
dipole: -10.96648 11.53828 0.57180 -13.24817 12.30834 -0.93982 5.09522 -5.12028 -0.02506
magnitude: 1.10039 au
magnitude: 2.79697 debye
