program: Orca
programVersion: 5.0.2
elementType: O O O C C C C C C C C C C C C C C C C C C C C C C C H H H H H H H H H H H H H H H H H H H H H H H H H H
charge: 0
multiplicity: 1
keywords: wb97x-d3
keywords: def2-TZVPP
keywords: def2/J RIJCOSX
keywords: DEFGRID2
keywords: scfconv7
keywords: smallprint printgap noloewdin
keywords: NOSOSCF
formula: C23H26O3
InChI: InChI=1/C23H26O3/c1-16(2)13-20-21(23(20,3)4)22(24)25-15-17-9-8-12-19(14-17)26-18-10-6-5-7-11-18/h5-14,20-21H,15H2,1-4H3
52 atoms
O  -1.815655 1.711884 -1.257758
O  -1.275803 -0.43399 -1.583967
O  3.573683 1.275227 -0.61757
C  -3.846058 -0.915017 0.161259
C  -2.700062 -0.987226 1.123119
C  -2.805133 0.191716 0.162233
C  -5.196045 -0.526496 0.713975
C  -3.934709 -1.903095 -0.973659
C  -1.648488 -2.024909 1.035174
C  -1.885138 0.410404 -0.969684
C  -1.451668 -2.992213 1.937664
C  -0.361885 -4.004456 1.747403
C  -2.263549 -3.181924 3.182336
C  -0.953544 2.154532 -2.316493
C  0.360329 2.619675 -1.75746
C  1.361251 1.701888 -1.454852
C  0.573857 3.972869 -1.512897
C  2.552251 2.142021 -0.894473
C  1.776661 4.403299 -0.972636
C  2.768553 3.490152 -0.648871
C  3.317177 0.116215 0.06121
C  4.105764 -0.982209 -0.254311
C  2.356934 0.032368 1.063226
C  3.934056 -2.169592 0.441736
C  2.189504 -1.165711 1.743107
C  2.973686 -2.270394 1.4390
H  -2.953981 -0.692168 2.13608
H  -3.133942 1.115483 0.623863
H  -5.725902 -1.406037 1.086232
H  -5.818838 -0.06742 -0.0568
H  -5.11112 0.182532 1.53869
H  -4.486451 -1.47846 -1.814868
H  -4.480474 -2.787808 -0.638964
H  -2.970604 -2.240693 -1.344035
H  -0.997965 -2.01196 0.169714
H  0.331172 -4.004774 2.593312
H  0.21297 -3.82676 0.838716
H  -0.774496 -5.015827 1.690359
H  -2.70616 -4.181575 3.198714
H  -3.075585 -2.465977 3.295759
H  -1.631062 -3.114148 4.071715
H  -1.480712 2.982693 -2.788706
H  -0.818878 1.371513 -3.062603
H  1.215372 0.648784 -1.662018
H  -0.200061 4.692156 -1.750977
H  1.940907 5.457097 -0.788658
H  3.705099 3.818669 -0.215918
H  4.85146 -0.903567 -1.035718
H  1.744984 0.886921 1.323253
H  4.552483 -3.022778 0.194235
H  1.441971 -1.227321 2.5236
H  2.840719 -3.199617 1.976869
elementType: O C H
totalener: -1117.86611340 hartree
nucrepener: 2305.36418089 hartree
electener: -3423.23029429 hartree
oneelecener: -6100.78163540 hartree
twoeener: 2677.55134111 hartree
cpcmener: -0.02353786 hartree
kineticenergy: 1112.80252149 hartree
xcener: -110.227155059431 hartree
chargesum: -0.0000000
charge: -0.287510 -0.478424 -0.331708 0.146039 0.003255 -0.126008 -0.268283 -0.284579 -0.306403 0.416151 -0.013715 -0.262550 -0.258450 0.080865 -0.024722 -0.144355 -0.212042 0.228172 -0.122005 -0.230415 0.290085 -0.252291 -0.177037 -0.117518 -0.156355 -0.200951 0.110166 0.096509 0.093313 0.094567 0.087641 0.102189 0.096312 0.097337 0.133783 0.095149 0.092505 0.109052 0.095514 0.087754 0.096606 0.115187 0.116255 0.149234 0.142246 0.157154 0.146720 0.144161 0.151544 0.157231 0.162403 0.160223
qa: -0.2875 -0.4784 -0.3317 0.1460 0.0033 -0.1260 -0.2683 -0.2846 -0.3064 0.4162 -0.0137 -0.2626 -0.2585 0.0809 -0.0247 -0.1444 -0.2120 0.2282 -0.1220 -0.2304 0.2901 -0.2523 -0.1770 -0.1175 -0.1564 -0.2010 0.1102 0.0965 0.0933 0.0946 0.0876 0.1022 0.0963 0.0973 0.1338 0.0951 0.0925 0.1091 0.0955 0.0878 0.0966 0.1152 0.1163 0.1492 0.1422 0.1572 0.1467 0.1442 0.1515 0.1572 0.1624 0.1602
va: 2.1289 2.0082 2.0731 3.6941 3.7632 3.9521 3.9061 3.9053 3.8283 4.0855 3.6735 3.9342 3.9471 3.8094 3.6909 3.8768 3.9727 3.7872 3.8936 4.0155 3.6871 4.0126 3.8793 3.9056 3.8567 3.8850 1.0040 1.0288 1.0023 1.0025 1.0049 1.0001 1.0020 1.0142 1.0194 0.9909 1.0045 1.0003 0.9973 1.0098 0.9974 0.9984 1.0182 1.0201 1.0030 0.9890 1.0052 1.0087 1.0008 0.9892 0.9873 0.9879
dispcorr: -0.026591386 hartree
energy: -1117.892704784695
dipole: -21.97639 20.87842 -1.09798 -19.01314 19.44462 0.43149 11.75154 -11.00648 0.74506
magnitude: 1.39529 au
magnitude: 3.54656 debye
