program: Orca
programVersion: 5.0.2
elementType: O O O C C C C C C C C C C C C C C C C C C C C C C C H H H H H H H H H H H H H H H H H H H H H H H H H H
charge: 0
multiplicity: 1
keywords: wb97x-d3
keywords: def2-TZVPP
keywords: def2/J RIJCOSX
keywords: DEFGRID2
keywords: scfconv7
keywords: smallprint printgap noloewdin
keywords: NOSOSCF
formula: C23H26O3
InChI: InChI=1/C23H26O3/c1-16(2)13-20-21(23(20,3)4)22(24)25-15-17-9-8-12-19(14-17)26-18-10-6-5-7-11-18/h5-14,20-21H,15H2,1-4H3
52 atoms
O  -2.202553 1.382709 -1.553971
O  -2.305987 -0.782829 -1.017432
O  3.737776 0.330244 -1.512649
C  -5.223926 -0.194911 -0.096626
C  -4.366605 0.165794 1.06771
C  -4.043158 0.726483 -0.32754
C  -6.56968 0.488638 -0.183431
C  -5.254307 -1.598826 -0.647927
C  -3.47281 -0.799779 1.747133
C  -2.793065 0.321207 -0.987967
C  -2.589872 -0.479724 2.698216
C  -1.755037 -1.528225 3.367619
C  -2.348284 0.919646 3.17592
C  -0.944699 1.19231 -2.182991
C  0.203194 1.070991 -1.215397
C  1.441432 0.705599 -1.732073
C  0.084402 1.341466 0.142625
C  2.551859 0.625094 -0.905439
C  1.200264 1.240234 0.963143
C  2.441012 0.890271 0.455067
C  4.724704 -0.331877 -0.833394
C  6.015052 0.165967 -0.93958
C  4.468643 -1.495604 -0.118342
C  7.06038 -0.510604 -0.326517
C  5.52123 -2.154622 0.499664
C  6.818316 -1.667877 0.399987
H  -4.780137 0.931252 1.717003
H  -4.292049 1.771897 -0.468223
H  -6.912882 0.548004 -1.218347
H  -6.539817 1.50368 0.21536
H  -7.319113 -0.06751 0.383493
H  -6.007203 -2.182727 -0.114454
H  -4.311782 -2.132363 -0.572353
H  -5.539998 -1.585395 -1.701531
H  -3.564831 -1.84487 1.470615
H  -0.690341 -1.345596 3.197311
H  -1.985276 -2.531155 3.008099
H  -1.8999 -1.516638 4.451431
H  -1.278863 1.145883 3.178256
H  -2.686975 1.040849 4.209056
H  -2.845163 1.677806 2.573023
H  -0.806917 2.079028 -2.80364
H  -0.969412 0.330651 -2.854521
H  1.549427 0.486907 -2.788987
H  -0.861007 1.639777 0.576199
H  1.105068 1.450517 2.02092
H  3.300038 0.836077 1.111187
H  6.198914 1.072281 -1.503076
H  3.46264 -1.89024 -0.046325
H  8.067296 -0.123062 -0.413569
H  5.323399 -3.061044 1.057238
H  7.63456 -2.190175 0.881471
elementType: O C H
totalener: -1117.86672238 hartree
nucrepener: 2226.88839698 hartree
electener: -3344.75511936 hartree
oneelecener: -5943.73088810 hartree
twoeener: 2598.97576874 hartree
cpcmener: -0.02715894 hartree
kineticenergy: 1112.79134051 hartree
xcener: -110.227410878742 hartree
chargesum: -0.0000000
charge: -0.299712 -0.457147 -0.328000 0.136734 -0.030401 -0.074853 -0.258223 -0.296444 -0.241228 0.357479 -0.029510 -0.222721 -0.295333 0.084092 0.039361 -0.269137 -0.224126 0.278759 -0.159519 -0.193088 0.271416 -0.236669 -0.189865 -0.127661 -0.144492 -0.179167 0.109621 0.091873 0.095084 0.086138 0.094997 0.099296 0.092960 0.099952 0.122367 0.091101 0.088733 0.094315 0.091534 0.115185 0.093500 0.129522 0.114863 0.128091 0.161489 0.156881 0.153289 0.145362 0.159040 0.157679 0.159082 0.157503
qa: -0.2997 -0.4571 -0.3280 0.1367 -0.0304 -0.0749 -0.2582 -0.2964 -0.2412 0.3575 -0.0295 -0.2227 -0.2953 0.0841 0.0394 -0.2691 -0.2241 0.2788 -0.1595 -0.1931 0.2714 -0.2367 -0.1899 -0.1277 -0.1445 -0.1792 0.1096 0.0919 0.0951 0.0861 0.0950 0.0993 0.0930 0.1000 0.1224 0.0911 0.0887 0.0943 0.0915 0.1152 0.0935 0.1295 0.1149 0.1281 0.1615 0.1569 0.1533 0.1454 0.1590 0.1577 0.1591 0.1575
va: 2.1110 2.0276 2.0738 3.7805 3.7876 3.8349 3.8915 3.8939 3.8426 4.1230 3.7038 3.9280 3.9560 3.8201 3.6849 4.0776 3.9335 3.7347 3.9337 3.9178 3.6972 4.0076 3.9204 3.8863 3.8898 3.9003 1.0020 1.0313 1.0029 1.0045 1.0023 0.9990 1.0204 0.9997 1.0037 0.9974 1.0085 0.9955 0.9949 0.9999 1.0049 0.9905 1.0127 1.0191 0.9932 0.9932 0.9988 1.0078 0.9957 0.9893 0.9903 0.9906
dispcorr: -0.025390780 hartree
energy: -1117.892113162813
dipole: -24.93520 24.59175 -0.34345 -3.69664 4.43166 0.73501 14.63830 -13.92001 0.71829
magnitude: 1.08358 au
magnitude: 2.75424 debye
