program: Orca
programVersion: 5.0.2
elementType: O O O C C C C C C C C C C C C C C C C C C C C C C C H H H H H H H H H H H H H H H H H H H H H H H H H H
charge: 0
multiplicity: 1
keywords: wb97x-d3
keywords: def2-TZVPP
keywords: def2/J RIJCOSX
keywords: DEFGRID2
keywords: scfconv7
keywords: smallprint printgap noloewdin
keywords: NOSOSCF
formula: C23H26O3
InChI: InChI=1/C23H26O3/c1-16(2)13-20-21(23(20,3)4)22(24)25-15-17-9-8-12-19(14-17)26-18-10-6-5-7-11-18/h5-14,20-21H,15H2,1-4H3
52 atoms
O  -1.7564 1.093449 -0.388043
O  -3.864057 1.699143 -0.00956
O  3.297107 0.820911 -0.188681
C  -2.734424 -1.753772 -0.810807
C  -2.485161 -1.642048 0.653346
C  -3.367933 -0.60392 -0.047548
C  -3.715727 -2.806552 -1.273502
C  -1.616863 -1.5337 -1.801539
C  -1.151154 -1.331911 1.223006
C  -3.032857 0.827789 -0.146806
C  -0.964929 -0.751109 2.410999
C  0.406658 -0.534123 2.9688
C  -2.11505 -0.286047 3.2603
C  -1.355637 2.46123 -0.42141
C  0.100825 2.527732 -0.778478
C  1.005459 1.576942 -0.314687
C  0.555729 3.598736 -1.540037
C  2.350205 1.694244 -0.64161
C  1.905687 3.718645 -1.834926
C  2.80908 2.763245 -1.400009
C  3.041707 -0.515674 -0.063078
C  3.653082 -1.166393 1.000741
C  2.27093 -1.224721 -0.976603
C  3.487438 -2.534846 1.152949
C  2.103581 -2.5917 -0.803696
C  2.70586 -3.253004 0.258186
H  -3.082415 -2.304996 1.276186
H  -4.428591 -0.724928 0.140662
H  -4.515229 -2.968234 -0.549225
H  -3.2099 -3.762352 -1.426579
H  -4.178099 -2.521857 -2.220882
H  -0.827794 -0.875979 -1.448143
H  -2.003839 -1.11757 -2.733762
H  -1.155368 -2.494101 -2.041623
H  -0.281007 -1.64531 0.652662
H  1.184394 -0.935726 2.319265
H  0.510808 -1.008248 3.948978
H  0.608089 0.530016 3.120458
H  -2.696836 -1.127361 3.646068
H  -2.810089 0.346324 2.704146
H  -1.770766 0.287018 4.121465
H  -1.526886 2.917381 0.558366
H  -1.945973 3.018462 -1.151844
H  0.663886 0.753066 0.300441
H  -0.144984 4.340539 -1.903285
H  2.256623 4.555215 -2.425142
H  3.86154 2.84298 -1.641415
H  4.254756 -0.601444 1.701975
H  1.805791 -0.726838 -1.817916
H  3.96575 -3.037935 1.983504
H  1.499859 -3.142614 -1.513579
H  2.571656 -4.319341 0.383364
elementType: O C H
totalener: -1117.86255486 hartree
nucrepener: 2394.26766633 hartree
electener: -3512.13022119 hartree
oneelecener: -6277.43956832 hartree
twoeener: 2765.30934713 hartree
cpcmener: -0.02446439 hartree
kineticenergy: 1112.79508051 hartree
xcener: -110.231087051058 hartree
chargesum: 0.0000000
charge: -0.261764 -0.479318 -0.326581 0.144953 -0.039592 -0.138439 -0.269016 -0.277467 -0.163728 0.406540 -0.073914 -0.181011 -0.264560 0.076541 0.021880 -0.184952 -0.226596 0.302473 -0.116672 -0.252442 0.307077 -0.247520 -0.209244 -0.107214 -0.129171 -0.197221 0.109314 0.091952 0.086597 0.092906 0.096766 0.055128 0.107941 0.100354 0.097884 0.026769 0.112479 0.099270 0.104815 0.095422 0.097031 0.118803 0.108626 0.072142 0.140390 0.156941 0.144292 0.141329 0.158433 0.156328 0.158666 0.156378
qa: -0.2618 -0.4793 -0.3266 0.1450 -0.0396 -0.1384 -0.2690 -0.2775 -0.1637 0.4065 -0.0739 -0.1810 -0.2646 0.0765 0.0219 -0.1850 -0.2266 0.3025 -0.1167 -0.2524 0.3071 -0.2475 -0.2092 -0.1072 -0.1292 -0.1972 0.1093 0.0920 0.0866 0.0929 0.0968 0.0551 0.1079 0.1004 0.0979 0.0268 0.1125 0.0993 0.1048 0.0954 0.0970 0.1188 0.1086 0.0721 0.1404 0.1569 0.1443 0.1413 0.1584 0.1563 0.1587 0.1564
va: 2.1175 2.0256 2.0962 3.7284 3.7930 3.8727 3.9050 3.9213 3.6985 4.1204 3.7318 3.8799 3.9337 3.8069 3.7509 3.8747 3.9578 3.6946 3.9024 3.9974 3.6508 3.9536 3.8528 3.8507 3.8261 3.9060 1.0058 1.0304 1.0059 1.0020 1.0015 1.0017 1.0059 0.9979 0.9933 1.0395 0.9991 0.9991 0.9958 1.0044 1.0055 0.9925 1.0075 1.0448 1.0026 0.9893 1.0085 1.0111 0.9926 0.9889 0.9923 0.9916
dispcorr: -0.031573470 hartree
energy: -1117.894128325084
dipole: -10.56161 11.13233 0.57072 -13.07368 12.13777 -0.93592 5.77732 -5.81156 -0.03424
magnitude: 1.09674 au
magnitude: 2.78769 debye
