program: Orca
programVersion: 5.0.2
elementType: O O O C C C C C C C C C C C C C C C C C C C C C C C H H H H H H H H H H H H H H H H H H H H H H H H H H
charge: 0
multiplicity: 1
keywords: wb97x-d3
keywords: def2-TZVPP
keywords: def2/J RIJCOSX
keywords: DEFGRID2
keywords: scfconv7
keywords: smallprint printgap noloewdin
keywords: NOSOSCF
formula: C23H26O3
InChI: InChI=1/C23H26O3/c1-16(2)13-20-21(23(20,3)4)22(24)25-15-17-9-8-12-19(14-17)26-18-10-6-5-7-11-18/h5-14,20-21H,15H2,1-4H3
52 atoms
O  -1.220308 1.996886 0.653599
O  -1.167622 -0.222692 0.859278
O  3.288839 -0.816965 -1.94304
C  -4.133016 0.040237 -0.165233
C  -4.237713 -0.068199 1.324624
C  -3.269867 0.938951 0.705202
C  -5.260971 0.743828 -0.881984
C  -3.522819 -1.070959 -0.982732
C  -3.799689 -1.252491 2.088417
C  -1.804218 0.798345 0.755174
C  -4.446201 -1.800273 3.124733
C  -3.886493 -3.009272 3.814404
C  -5.73444 -1.304545 3.708413
C  0.20679 2.029217 0.602986
C  0.742678 1.505857 -0.700743
C  1.779801 0.58381 -0.701483
C  0.215425 1.95084 -1.91129
C  2.297083 0.125774 -1.907455
C  0.724882 1.469227 -3.106205
C  1.773826 0.559717 -3.114303
C  4.420858 -0.636718 -1.197951
C  5.024807 -1.776877 -0.684606
C  4.989158 0.615779 -0.996385
C  6.206278 -1.660899 0.032878
C  6.166314 0.716263 -0.268214
C  6.780148 -0.415605 0.25022
H  -5.104734 0.435234 1.737242
H  -3.600445 1.969918 0.75574
H  -6.062867 0.041174 -1.118026
H  -4.916098 1.181304 -1.821322
H  -5.689906 1.545743 -0.279497
H  -2.755983 -1.640608 -0.465272
H  -3.077819 -0.673835 -1.897425
H  -4.304356 -1.773621 -1.278696
H  -2.876864 -1.726383 1.779011
H  -4.582038 -3.851388 3.76197
H  -3.721662 -2.813192 4.877655
H  -2.938212 -3.329316 3.382549
H  -5.584396 -0.960668 4.7357
H  -6.465666 -2.115338 3.761393
H  -6.192338 -0.489178 3.151937
H  0.638703 1.490867 1.449036
H  0.458458 3.083656 0.720808
H  2.17722 0.217873 0.238491
H  -0.592865 2.671638 -1.924797
H  0.312411 1.812644 -4.045985
H  2.179245 0.188926 -4.04721
H  4.572769 -2.746906 -0.850582
H  4.529998 1.507568 -1.404285
H  6.674823 -2.552199 0.430121
H  6.607847 1.692351 -0.112739
H  7.69871 -0.328144 0.815325
elementType: O C H
totalener: -1117.86742995 hartree
nucrepener: 2193.34594379 hartree
electener: -3311.21337374 hartree
oneelecener: -5876.82322785 hartree
twoeener: 2565.60985411 hartree
cpcmener: -0.02583676 hartree
kineticenergy: 1112.79883055 hartree
xcener: -110.226801117851 hartree
chargesum: 0.0000000
charge: -0.293066 -0.464955 -0.332403 0.101661 0.031599 -0.091114 -0.262393 -0.280448 -0.291955 0.391391 -0.055043 -0.218699 -0.256532 0.098296 0.032966 -0.171605 -0.247576 0.230990 -0.118154 -0.233230 0.263164 -0.241194 -0.170809 -0.124269 -0.156197 -0.184898 0.115983 0.095449 0.094843 0.093189 0.086265 0.095691 0.098560 0.098274 0.122282 0.092430 0.091371 0.088299 0.098148 0.093711 0.087456 0.112936 0.122600 0.141295 0.140765 0.156452 0.146452 0.146272 0.152820 0.156615 0.158941 0.157372
qa: -0.2931 -0.4650 -0.3324 0.1017 0.0316 -0.0911 -0.2624 -0.2804 -0.2920 0.3914 -0.0550 -0.2187 -0.2565 0.0983 0.0330 -0.1716 -0.2476 0.2310 -0.1182 -0.2332 0.2632 -0.2412 -0.1708 -0.1243 -0.1562 -0.1849 0.1160 0.0954 0.0948 0.0932 0.0863 0.0957 0.0986 0.0983 0.1223 0.0924 0.0914 0.0883 0.0981 0.0937 0.0875 0.1129 0.1226 0.1413 0.1408 0.1565 0.1465 0.1463 0.1528 0.1566 0.1589 0.1574
va: 2.1161 2.0320 2.0654 3.7154 3.7403 3.8445 3.9095 3.9093 3.8543 4.1237 3.7816 3.9224 3.9389 3.8066 3.6106 3.9397 3.9533 3.7492 3.8904 4.0181 3.7157 3.9958 3.8812 3.8930 3.9033 3.9011 1.0029 1.0299 1.0016 1.0025 1.0056 1.0137 1.0006 1.0011 1.0260 0.9967 0.9959 1.0090 0.9961 0.9975 1.0137 1.0109 0.9914 1.0087 1.0116 0.9893 1.0052 1.0081 0.9994 0.9893 0.9906 0.9906
dispcorr: -0.023345774 hartree
energy: -1117.890775719784
dipole: -30.33121 29.66362 -0.66759 -6.50061 7.67253 1.17192 11.37012 -11.17766 0.19245
magnitude: 1.36239 au
magnitude: 3.46293 debye
