program: Orca
programVersion: 5.0.2
elementType: O O O C C C C C C C C C C C C C C C C C C C C C C C H H H H H H H H H H H H H H H H H H H H H H H H H H
charge: 0
multiplicity: 1
keywords: wb97x-d3
keywords: def2-TZVPP
keywords: def2/J RIJCOSX
keywords: DEFGRID2
keywords: scfconv7
keywords: smallprint printgap noloewdin
keywords: NOSOSCF
formula: C23H26O3
InChI: InChI=1/C23H26O3/c1-16(2)13-20-21(23(20,3)4)22(24)25-15-17-9-8-12-19(14-17)26-18-10-6-5-7-11-18/h5-14,20-21H,15H2,1-4H3
52 atoms
O  -2.225027 1.599507 -1.588022
O  -2.293615 -0.628913 -1.523301
O  3.246222 -0.747022 -1.31391
C  -4.99954 -0.394234 -0.059457
C  -4.11414 0.230849 0.978556
C  -4.033471 0.676576 -0.491987
C  -6.447152 0.041946 -0.047749
C  -4.840531 -1.843839 -0.452588
C  -2.988641 -0.473269 1.619192
C  -2.791291 0.435526 -1.248876
C  -2.53086 -0.270932 2.860841
C  -1.350115 -1.044482 3.368188
C  -3.087626 0.717678 3.841215
C  -0.926293 1.543667 -2.172268
C  0.124032 1.090719 -1.193598
C  1.224409 0.38404 -1.661002
C  0.036127 1.405376 0.159407
C  2.223247 -0.014691 -0.782931
C  1.030852 0.985175 1.029478
C  2.128944 0.270948 0.573199
C  4.505115 -0.658683 -0.783728
C  5.199485 -1.842868 -0.584463
C  5.100235 0.567258 -0.510163
C  6.502468 -1.798496 -0.107966
C  6.398538 0.59598 -0.023199
C  7.10514 -0.582254 0.180724
H  -4.602031 0.973465 1.599091
H  -4.462449 1.655464 -0.676285
H  -7.023308 -0.554243 0.662825
H  -6.901468 -0.085534 -1.032817
H  -6.557827 1.090232 0.234051
H  -5.495358 -2.454917 0.171911
H  -3.833471 -2.233553 -0.344016
H  -5.144469 -1.997857 -1.489637
H  -2.472028 -1.21679 1.022399
H  -1.623868 -1.664139 4.226782
H  -0.561392 -0.371776 3.716355
H  -0.9225 -1.695965 2.605906
H  -2.386599 1.545412 3.992214
H  -3.225936 0.251087 4.820706
H  -4.04387 1.148224 3.546098
H  -0.727206 2.565949 -2.496614
H  -0.924898 0.912412 -3.063602
H  1.305264 0.129096 -2.711683
H  -0.803867 1.968664 0.544866
H  0.953182 1.216063 2.084152
H  2.888948 -0.058802 1.269778
H  4.724347 -2.790633 -0.805457
H  4.562473 1.492349 -0.677501
H  7.043877 -2.723475 0.043771
H  6.86185 1.550685 0.190499
H  8.11932 -0.551282 0.556537
elementType: O C H
totalener: -1117.86609992 hartree
nucrepener: 2237.38429205 hartree
electener: -3355.25039197 hartree
oneelecener: -5964.86299939 hartree
twoeener: 2609.61260742 hartree
cpcmener: -0.02654941 hartree
kineticenergy: 1112.78877096 hartree
xcener: -110.226559729601 hartree
chargesum: -0.0000000
charge: -0.291868 -0.451670 -0.328301 0.116237 0.046078 -0.096409 -0.266391 -0.278601 -0.314703 0.371639 -0.050553 -0.228630 -0.260160 0.096045 0.068789 -0.276036 -0.257704 0.280585 -0.155504 -0.185436 0.265819 -0.236399 -0.181431 -0.128116 -0.148416 -0.178425 0.112049 0.098187 0.095211 0.093828 0.086498 0.091931 0.094769 0.099735 0.122310 0.107937 0.086227 0.091540 0.099555 0.095637 0.090805 0.121441 0.114694 0.128758 0.144344 0.162947 0.153577 0.146666 0.156402 0.157480 0.158979 0.158055
qa: -0.2919 -0.4517 -0.3283 0.1162 0.0461 -0.0964 -0.2664 -0.2786 -0.3147 0.3716 -0.0506 -0.2286 -0.2602 0.0960 0.0688 -0.2760 -0.2577 0.2806 -0.1555 -0.1854 0.2658 -0.2364 -0.1814 -0.1281 -0.1484 -0.1784 0.1120 0.0982 0.0952 0.0938 0.0865 0.0919 0.0948 0.0997 0.1223 0.1079 0.0862 0.0915 0.0996 0.0956 0.0908 0.1214 0.1147 0.1288 0.1443 0.1629 0.1536 0.1467 0.1564 0.1575 0.1590 0.1581
va: 2.1094 2.0468 2.0718 3.7346 3.7370 3.8203 3.9047 3.8952 3.8519 4.1580 3.7611 3.9181 3.9387 3.7989 3.6200 4.0936 3.9307 3.7342 3.8867 3.9090 3.7044 4.0039 3.9118 3.8877 3.8925 3.8988 1.0030 1.0285 1.0021 1.0022 1.0046 1.0015 1.0131 1.0004 1.0179 0.9987 0.9963 1.0085 0.9958 0.9976 1.0122 0.9916 1.0113 1.0205 1.0128 0.9864 0.9985 1.0074 0.9967 0.9894 0.9903 0.9904
dispcorr: -0.025611777 hartree
energy: -1117.891711697224
dipole: -23.42166 23.27936 -0.14230 -1.91340 3.11345 1.20005 16.72381 -15.75075 0.97306
magnitude: 1.55152 au
magnitude: 3.94366 debye
