program: Orca
programVersion: 5.0.2
elementType: O O O C C C C C C C C C C C C C C C C C C C C C C C H H H H H H H H H H H H H H H H H H H H H H H H H H
charge: 0
multiplicity: 1
keywords: wb97x-d3
keywords: def2-TZVPP
keywords: def2/J RIJCOSX
keywords: DEFGRID2
keywords: scfconv7
keywords: smallprint printgap noloewdin
keywords: NOSOSCF
formula: C23H26O3
InChI: InChI=1/C23H26O3/c1-16(2)13-20-21(23(20,3)4)22(24)25-15-17-9-8-12-19(14-17)26-18-10-6-5-7-11-18/h5-14,20-21H,15H2,1-4H3
52 atoms
O  -1.863287 2.379191 -0.206167
O  -2.642668 0.776888 -1.547265
O  2.420932 -0.224946 0.406875
C  -4.623053 0.064312 0.734277
C  -3.349734 -0.500996 1.288754
C  -3.386505 0.931497 0.739822
C  -5.675846 0.469585 1.740215
C  -5.218008 -0.484291 -0.539477
C  -2.58498 -1.573608 0.62632
C  -2.625921 1.31167 -0.464653
C  -2.058822 -2.647625 1.226984
C  -1.300209 -3.668197 0.43204
C  -2.155964 -2.959514 2.689266
C  -0.985095 2.827237 -1.236963
C  0.142337 1.865608 -1.492244
C  0.80832 1.264394 -0.428491
C  0.550099 1.599151 -2.792731
C  1.859513 0.395699 -0.674775
C  1.616371 0.741354 -3.02609
C  2.275356 0.126753 -1.973743
C  3.778959 -0.338603 0.509096
C  4.269682 -1.498356 1.09401
C  4.644593 0.673109 0.109993
C  5.636025 -1.642828 1.284208
C  6.009673 0.509622 0.298102
C  6.513059 -0.644151 0.883534
H  -3.299733 -0.510421 2.371564
H  -3.360812 1.692664 1.511307
H  -6.327944 1.24566 1.333575
H  -5.235601 0.856046 2.660643
H  -6.302426 -0.384188 2.00651
H  -5.921204 -1.281133 -0.288727
H  -4.491408 -0.899866 -1.23092
H  -5.777911 0.28827 -1.06999
H  -2.438292 -1.486648 -0.444356
H  -1.773352 -4.651671 0.501144
H  -0.28358 -3.789057 0.816398
H  -1.230334 -3.402714 -0.622802
H  -2.729266 -2.234684 3.263502
H  -1.160149 -3.02446 3.135624
H  -2.62174 -3.937057 2.839532
H  -0.597537 3.777864 -0.868707
H  -1.535844 3.031429 -2.15764
H  0.51257 1.458221 0.596034
H  0.030683 2.055845 -3.62617
H  1.926187 0.531323 -4.041609
H  3.090641 -0.559379 -2.166232
H  3.583603 -2.277497 1.402381
H  4.266352 1.585013 -0.334936
H  6.014716 -2.54747 1.742423
H  6.682738 1.29879 -0.011645
H  7.57882 -0.762147 1.028419
elementType: O C H
totalener: -1117.86725668 hartree
nucrepener: 2247.34212839 hartree
electener: -3365.20938507 hartree
oneelecener: -5984.94898259 hartree
twoeener: 2619.73959752 hartree
cpcmener: -0.02607836 hartree
kineticenergy: 1112.80030416 hartree
xcener: -110.227230436275 hartree
chargesum: 0.0000000
charge: -0.293526 -0.458544 -0.331172 0.116587 0.041638 -0.103454 -0.262834 -0.283774 -0.305894 0.384892 -0.046485 -0.220971 -0.254274 0.102435 0.052926 -0.295478 -0.213773 0.268959 -0.129019 -0.194022 0.268052 -0.242183 -0.177218 -0.127828 -0.154310 -0.181773 0.113605 0.096528 0.093728 0.086435 0.093966 0.093668 0.096687 0.100959 0.120465 0.093642 0.091856 0.088796 0.087633 0.096540 0.095004 0.119829 0.113457 0.126960 0.141053 0.158212 0.156951 0.147334 0.154491 0.156999 0.158847 0.157397
qa: -0.2935 -0.4585 -0.3312 0.1166 0.0416 -0.1035 -0.2628 -0.2838 -0.3059 0.3849 -0.0465 -0.2210 -0.2543 0.1024 0.0529 -0.2955 -0.2138 0.2690 -0.1290 -0.1940 0.2681 -0.2422 -0.1772 -0.1278 -0.1543 -0.1818 0.1136 0.0965 0.0937 0.0864 0.0940 0.0937 0.0967 0.1010 0.1205 0.0936 0.0919 0.0888 0.0876 0.0965 0.0950 0.1198 0.1135 0.1270 0.1411 0.1582 0.1570 0.1473 0.1545 0.1570 0.1588 0.1574
va: 2.1117 2.0401 2.0605 3.7147 3.7428 3.8539 3.9068 3.9015 3.8550 4.1247 3.7785 3.9238 3.9399 3.7995 3.6097 4.0470 3.9714 3.7263 3.8960 3.9335 3.7100 3.9919 3.8925 3.8926 3.9005 3.8992 1.0037 1.0298 1.0021 1.0051 1.0021 1.0013 1.0134 1.0001 1.0223 0.9971 0.9967 1.0089 1.0131 0.9969 0.9972 0.9921 1.0094 1.0315 1.0037 0.9905 0.9956 1.0069 0.9985 0.9896 0.9906 0.9905
dispcorr: -0.023997868 hartree
energy: -1117.891254546448
dipole: -19.74554 20.10812 0.36259 -12.65216 13.04110 0.38894 7.86461 -7.26582 0.59878
magnitude: 0.80080 au
magnitude: 2.03547 debye
