program: Orca
programVersion: 5.0.2
elementType: O O O C C C C C C C C C C C C C C C C C C C C C C C H H H H H H H H H H H H H H H H H H H H H H H H H H
charge: 0
multiplicity: 1
keywords: wb97x-d3
keywords: def2-TZVPP
keywords: def2/J RIJCOSX
keywords: DEFGRID2
keywords: scfconv7
keywords: smallprint printgap noloewdin
keywords: NOSOSCF
formula: C23H26O3
InChI: InChI=1/C23H26O3/c1-16(2)13-20-21(23(20,3)4)22(24)25-15-17-9-8-12-19(14-17)26-18-10-6-5-7-11-18/h5-14,20-21H,15H2,1-4H3
52 atoms
O  -2.301307 1.766147 -1.371134
O  -2.260309 -0.45757 -1.592342
O  2.496783 -0.760109 -0.342184
C  -4.887267 -0.476269 0.062104
C  -3.795367 -0.419672 1.073147
C  -3.813664 0.582667 -0.090311
C  -6.236735 0.061921 0.478815
C  -4.997749 -1.635303 -0.897354
C  -2.753416 -1.470426 1.188073
C  -2.737329 0.532923 -1.092323
C  -1.530631 -1.276924 1.689328
C  -0.547332 -2.400861 1.804581
C  -1.038765 0.055522 2.165736
C  -1.1242 1.900544 -2.1803
C  0.103491 1.776697 -1.32349
C  0.805178 0.579684 -1.251423
C  0.519354 2.862681 -0.557235
C  1.904542 0.468149 -0.409747
C  1.621968 2.742906 0.273233
C  2.320577 1.546785 0.360119
C  3.834205 -0.856962 -0.059159
C  4.781054 -0.192222 -0.82872
C  4.219852 -1.687406 0.981766
C  6.127244 -0.367453 -0.545233
C  5.571357 -1.860874 1.249149
C  6.528185 -1.200867 0.49152
H  -4.06072 0.056566 2.013602
H  -4.112853 1.588816 0.179602
H  -6.147184 0.894555 1.178077
H  -6.825796 -0.717428 0.966775
H  -6.803757 0.413165 -0.385732
H  -5.494141 -1.323301 -1.818341
H  -5.610497 -2.419995 -0.448302
H  -4.04538 -2.079398 -1.171276
H  -3.023683 -2.470908 0.863314
H  0.343126 -2.199802 1.202302
H  -0.967385 -3.35183 1.476608
H  -0.201462 -2.521941 2.834917
H  -0.987184 0.081128 3.258291
H  -1.6664 0.88636 1.846306
H  -0.024394 0.245837 1.807652
H  -1.193881 2.898157 -2.611981
H  -1.12352 1.179498 -2.998208
H  0.5003 -0.274083 -1.843897
H  -0.015961 3.80259 -0.614763
H  1.944674 3.587497 0.868249
H  3.170923 1.465961 1.025254
H  4.473445 0.448928 -1.645826
H  3.469873 -2.19721 1.573702
H  6.866936 0.146014 -1.145931
H  5.873326 -2.510731 2.060352
H  7.580371 -1.336401 0.704722
elementType: O C H
totalener: -1117.86594769 hartree
nucrepener: 2301.24077245 hartree
electener: -3419.10672015 hartree
oneelecener: -6092.83186139 hartree
twoeener: 2673.72514125 hartree
cpcmener: -0.02460502 hartree
kineticenergy: 1112.80675235 hartree
xcener: -110.226554486405 hartree
chargesum: -0.0000000
charge: -0.289549 -0.463499 -0.329418 0.137183 -0.024300 -0.108263 -0.264494 -0.301784 -0.262184 0.384129 -0.009020 -0.210728 -0.286088 0.080947 0.013535 -0.229611 -0.217109 0.251392 -0.136270 -0.179842 0.226528 -0.159933 -0.216887 -0.158102 -0.137253 -0.166330 0.113605 0.092965 0.086352 0.093755 0.095332 0.099786 0.097936 0.095785 0.119092 0.079438 0.089957 0.095729 0.118916 0.094356 0.084886 0.121525 0.112793 0.127953 0.141348 0.158580 0.153381 0.157289 0.151453 0.158500 0.158213 0.158026
qa: -0.2895 -0.4635 -0.3294 0.1372 -0.0243 -0.1083 -0.2645 -0.3018 -0.2622 0.3841 -0.0090 -0.2107 -0.2861 0.0809 0.0135 -0.2296 -0.2171 0.2514 -0.1363 -0.1798 0.2265 -0.1599 -0.2169 -0.1581 -0.1373 -0.1663 0.1136 0.0930 0.0864 0.0938 0.0953 0.0998 0.0979 0.0958 0.1191 0.0794 0.0900 0.0957 0.1189 0.0944 0.0849 0.1215 0.1128 0.1280 0.1413 0.1586 0.1534 0.1573 0.1515 0.1585 0.1582 0.1580
va: 2.1105 2.0238 2.0373 3.7426 3.8196 3.8259 3.8971 3.8926 3.8512 4.1352 3.6868 3.9195 3.9514 3.8132 3.6286 3.9704 3.9633 3.6888 3.9085 3.8865 3.7600 3.9224 3.9711 3.9067 3.8947 3.8901 1.0036 1.0312 1.0044 1.0024 1.0025 1.0005 0.9986 1.0176 1.0023 1.0072 1.0096 0.9959 1.0000 1.0048 0.9996 0.9944 1.0139 1.0350 1.0043 0.9902 0.9998 0.9963 1.0006 0.9905 0.9904 0.9900
dispcorr: -0.027913815 hartree
energy: -1117.893861508129
dipole: -17.50203 17.86964 0.36761 -4.94226 6.10064 1.15838 9.43948 -8.71126 0.72822
magnitude: 1.41678 au
magnitude: 3.60118 debye
