program: Orca
programVersion: 5.0.2
elementType: O O O C C C C C C C C C C C C C C C C C C C C C C C H H H H H H H H H H H H H H H H H H H H H H H H H H
charge: 0
multiplicity: 1
keywords: wb97x-d3
keywords: def2-TZVPP
keywords: def2/J RIJCOSX
keywords: DEFGRID2
keywords: scfconv7
keywords: smallprint printgap noloewdin
keywords: NOSOSCF
formula: C23H26O3
InChI: InChI=1/C23H26O3/c1-16(2)13-20-21(23(20,3)4)22(24)25-15-17-9-8-12-19(14-17)26-18-10-6-5-7-11-18/h5-14,20-21H,15H2,1-4H3
52 atoms
O  -2.261208 1.956503 -1.229126
O  -1.801877 -0.190467 -1.629677
O  3.134594 0.342789 -1.529147
C  -4.280427 -0.84778 0.097199
C  -3.232525 -0.600694 1.138585
C  -3.452384 0.415734 0.008517
C  -5.715739 -0.625098 0.515185
C  -4.138177 -1.968649 -0.903528
C  -1.989093 -1.385091 1.248122
C  -2.429796 0.648126 -1.027264
C  -1.400945 -1.773683 2.385668
C  -0.115546 -2.545828 2.350547
C  -1.909379 -1.491546 3.766534
C  -1.255984 2.374264 -2.163741
C  0.10758 2.363918 -1.53367
C  1.0125 1.343825 -1.808953
C  0.46163 3.366893 -0.636157
C  2.255946 1.341266 -1.197847
C  1.710307 3.355372 -0.031925
C  2.617168 2.343752 -0.308316
C  3.642338 -0.453809 -0.542242
C  2.958666 -0.719553 0.638871
C  4.879161 -1.038045 -0.787641
C  3.535126 -1.562482 1.579673
C  5.435331 -1.886143 0.157735
C  4.772044 -2.146985 1.349461
H  -3.620365 -0.232042 2.081486
H  -3.957613 1.321857 0.322172
H  -6.341091 -0.388807 -0.348502
H  -5.813238 0.194333 1.22871
H  -6.123492 -1.522972 0.984248
H  -4.61655 -1.705113 -1.848916
H  -4.646329 -2.855483 -0.519256
H  -3.112937 -2.252554 -1.119522
H  -1.50025 -1.667191 0.323541
H  -0.23412 -3.532137 2.807851
H  0.661038 -2.033955 2.925535
H  0.254885 -2.689408 1.335527
H  -2.906035 -1.058148 3.793668
H  -1.237336 -0.809926 4.293077
H  -1.93678 -2.409499 4.357392
H  -1.542935 3.389162 -2.436137
H  -1.285913 1.764125 -3.067306
H  0.756424 0.552707 -2.502537
H  -0.235585 4.166295 -0.416281
H  1.9859 4.144244 0.65578
H  3.594769 2.340524 0.157842
H  1.986457 -0.283641 0.832581
H  5.399416 -0.828826 -1.714148
H  3.002985 -1.764894 2.500353
H  6.399406 -2.337813 -0.038226
H  5.212716 -2.802275 2.089004
elementType: O C H
totalener: -1117.86652776 hartree
nucrepener: 2280.19679564 hartree
electener: -3398.06332339 hartree
oneelecener: -6050.44786061 hartree
twoeener: 2652.38453722 hartree
cpcmener: -0.02437055 hartree
kineticenergy: 1112.81093794 hartree
xcener: -110.228207551961 hartree
chargesum: 0.0000000
charge: -0.290076 -0.474074 -0.332484 0.108865 0.033538 -0.102393 -0.263663 -0.284599 -0.294880 0.411534 -0.040176 -0.247918 -0.260139 0.087002 -0.024020 -0.173311 -0.201499 0.207209 -0.142609 -0.167223 0.281114 -0.181747 -0.241024 -0.165929 -0.127451 -0.192730 0.111800 0.095041 0.093158 0.086151 0.094321 0.101564 0.093826 0.097600 0.122368 0.103400 0.092906 0.092104 0.089624 0.099589 0.094355 0.123929 0.113463 0.130093 0.143654 0.159126 0.158380 0.157507 0.144293 0.166323 0.156575 0.157533
qa: -0.2901 -0.4741 -0.3325 0.1089 0.0335 -0.1024 -0.2637 -0.2846 -0.2949 0.4115 -0.0402 -0.2479 -0.2601 0.0870 -0.0240 -0.1733 -0.2015 0.2072 -0.1426 -0.1672 0.2811 -0.1817 -0.2410 -0.1659 -0.1275 -0.1927 0.1118 0.0950 0.0932 0.0862 0.0943 0.1016 0.0938 0.0976 0.1224 0.1034 0.0929 0.0921 0.0896 0.0996 0.0944 0.1239 0.1135 0.1301 0.1437 0.1591 0.1584 0.1575 0.1443 0.1663 0.1566 0.1575
va: 2.1248 2.0228 2.0652 3.7037 3.7432 3.8548 3.9106 3.9025 3.8634 4.1069 3.7566 3.9301 3.9411 3.8047 3.6382 4.0064 3.9644 3.7960 3.8980 3.9449 3.7108 3.8606 3.9882 3.8954 3.9033 3.9249 1.0054 1.0294 1.0021 1.0052 1.0019 0.9996 1.0013 1.0131 1.0215 0.9989 0.9915 1.0054 1.0124 0.9963 0.9974 0.9936 1.0121 1.0307 1.0038 0.9899 0.9945 0.9946 1.0087 0.9867 0.9888 0.9914
dispcorr: -0.025281153 hartree
energy: -1117.891808909317
dipole: -19.11556 18.48481 -0.63075 -12.61581 13.36618 0.75037 15.70791 -14.49055 1.21736
magnitude: 1.56297 au
magnitude: 3.97275 debye
