program: Orca
programVersion: 5.0.2
elementType: O O O C C C C C C C C C C C C C C C C C C C C C C C H H H H H H H H H H H H H H H H H H H H H H H H H H
charge: 0
multiplicity: 1
keywords: wb97x-d3
keywords: def2-TZVPP
keywords: def2/J RIJCOSX
keywords: DEFGRID2
keywords: scfconv7
keywords: smallprint printgap noloewdin
keywords: NOSOSCF
formula: C23H26O3
InChI: InChI=1/C23H26O3/c1-16(2)13-20-21(23(20,3)4)22(24)25-15-17-9-8-12-19(14-17)26-18-10-6-5-7-11-18/h5-14,20-21H,15H2,1-4H3
52 atoms
O  -1.765933 1.259698 0.073322
O  -3.175878 2.044943 1.606395
O  3.028848 0.04934 -1.560638
C  -3.847884 -0.775304 -0.743484
C  -3.155432 -1.4011 0.41858
C  -3.724515 0.018083 0.54322
C  -5.253411 -1.249818 -1.037253
C  -3.094257 -0.406796 -1.998527
C  -1.699949 -1.680608 0.446537
C  -2.879167 1.199069 0.790929
C  -1.013141 -1.92235 1.566275
C  0.440618 -2.275679 1.530041
C  -1.647118 -1.875081 2.926445
C  -0.894847 2.375016 0.296652
C  0.240213 2.271771 -0.677474
C  1.103739 1.179334 -0.631234
C  0.442154 3.272628 -1.61923
C  2.168976 1.108968 -1.517726
C  1.506676 3.187075 -2.506763
C  2.376437 2.111831 -2.458366
C  3.396134 -0.611429 -0.420822
C  3.686038 0.052943 0.765244
C  3.537088 -1.989119 -0.512348
C  4.100605 -0.680869 1.867373
C  3.965563 -2.708156 0.594346
C  4.240335 -2.060435 1.790573
H  -3.753246 -2.115517 0.978996
H  -4.637239 0.0830 1.124361
H  -5.82825 -0.476732 -1.551427
H  -5.794153 -1.51486 -0.127604
H  -5.234995 -2.132512 -1.679834
H  -2.042504 -0.18533 -1.845732
H  -3.548883 0.461254 -2.479989
H  -3.15007 -1.236353 -2.706552
H  -1.179659 -1.736394 -0.504693
H  0.819879 -2.346099 0.511263
H  0.626187 -3.234263 2.023189
H  1.038199 -1.534785 2.068134
H  -2.078226 -2.84361 3.196225
H  -2.446764 -1.136358 2.990668
H  -0.912122 -1.635626 3.696369
H  -0.527677 2.353116 1.325878
H  -1.433822 3.313134 0.152254
H  0.94038 0.393364 0.097427
H  -0.231036 4.119754 -1.661005
H  1.664581 3.967969 -3.239119
H  3.211325 2.043283 -3.144459
H  3.595263 1.129604 0.836549
H  3.313517 -2.492532 -1.444813
H  4.322463 -0.163576 2.792068
H  4.07357 -3.782567 0.519463
H  4.565001 -2.62425 2.65517
elementType: O C H
totalener: -1117.86404987 hartree
nucrepener: 2335.92733699 hartree
electener: -3453.79138687 hartree
oneelecener: -6161.03522519 hartree
twoeener: 2707.24383832 hartree
cpcmener: -0.02519504 hartree
kineticenergy: 1112.80505210 hartree
xcener: -110.228547162006 hartree
chargesum: 0.0000000
charge: -0.263615 -0.480470 -0.327920 0.148411 -0.037777 -0.124679 -0.268210 -0.281225 -0.266610 0.406429 -0.004467 -0.256623 -0.284067 0.068805 -0.029396 -0.206322 -0.184944 0.287966 -0.117611 -0.249836 0.319073 -0.208539 -0.289878 -0.132895 -0.094824 -0.195196 0.111300 0.092950 0.095947 0.086773 0.093151 0.080028 0.102692 0.097060 0.125162 0.098884 0.118012 0.095044 0.109343 0.095896 0.095018 0.121217 0.103446 0.140138 0.142196 0.156823 0.145385 0.153572 0.144015 0.157882 0.155875 0.156609
qa: -0.2636 -0.4805 -0.3279 0.1484 -0.0378 -0.1247 -0.2682 -0.2812 -0.2666 0.4064 -0.0045 -0.2566 -0.2841 0.0688 -0.0294 -0.2063 -0.1849 0.2880 -0.1176 -0.2498 0.3191 -0.2085 -0.2899 -0.1329 -0.0948 -0.1952 0.1113 0.0930 0.0959 0.0868 0.0932 0.0800 0.1027 0.0971 0.1252 0.0989 0.1180 0.0950 0.1093 0.0959 0.0950 0.1212 0.1034 0.1401 0.1422 0.1568 0.1454 0.1536 0.1440 0.1579 0.1559 0.1566
va: 2.1156 2.0250 2.0813 3.7426 3.8062 3.8713 3.9020 3.9087 3.8168 4.1218 3.7091 3.9257 3.9491 3.8141 3.7755 3.9086 3.9157 3.7056 3.9057 3.9992 3.6266 3.9146 3.9720 3.8516 3.8240 3.8900 1.0033 1.0298 1.0019 1.0052 1.0023 1.0089 1.0010 1.0002 0.9995 0.9979 0.9944 0.9908 0.9953 1.0017 1.0026 0.9954 1.0096 0.9871 1.0016 0.9896 1.0075 0.9982 1.0103 0.9909 0.9900 0.9917
dispcorr: -0.028810744 hartree
energy: -1117.892860618384
dipole: -13.93568 14.41020 0.47452 -12.86303 12.10039 -0.76264 4.33790 -4.58300 -0.24510
magnitude: 0.93105 au
magnitude: 2.36655 debye
