program: Orca
programVersion: 5.0.2
elementType: O O O C C C C C C C C C C C C C C C C C C C C C C C H H H H H H H H H H H H H H H H H H H H H H H H H H
charge: 0
multiplicity: 1
keywords: wb97x-d3
keywords: def2-TZVPP
keywords: def2/J RIJCOSX
keywords: DEFGRID2
keywords: scfconv7
keywords: smallprint printgap noloewdin
keywords: NOSOSCF
formula: C23H26O3
InChI: InChI=1/C23H26O3/c1-16(2)13-20-21(23(20,3)4)22(24)25-15-17-9-8-12-19(14-17)26-18-10-6-5-7-11-18/h5-14,20-21H,15H2,1-4H3
52 atoms
O  -1.303936 2.317512 0.566473
O  -0.798597 0.158119 0.803103
O  3.74318 0.550011 -2.066172
C  -3.742894 -0.203467 -0.241419
C  -3.863097 -0.291896 1.248913
C  -3.093776 0.867161 0.62062
C  -4.960136 0.250722 -1.010876
C  -2.908886 -1.20339 -1.002717
C  -3.2241 -1.351961 2.052265
C  -1.630902 1.025841 0.686522
C  -3.811302 -2.049447 3.031905
C  -3.048215 -3.106623 3.773419
C  -5.226529 -1.878082 3.495485
C  0.083359 2.633436 0.456118
C  0.674489 2.13272 -0.832905
C  1.933994 1.550117 -0.826464
C  -0.019179 2.266721 -2.033084
C  2.489816 1.091534 -2.014486
C  0.548159 1.808709 -3.211777
C  1.800955 1.212183 -3.211549
C  4.169676 -0.31855 -1.1002
C  5.518889 -0.276373 -0.774776
C  3.327167 -1.2493 -0.503151
C  6.027261 -1.174587 0.152165
C  3.848503 -2.133324 0.430749
C  5.195878 -2.102602 0.763778
H  -4.820597 0.043392 1.63179
H  -3.622685 1.813003 0.634498
H  -5.556282 0.970031 -0.447493
H  -5.603545 -0.598933 -1.249543
H  -4.6731 0.722946 -1.952919
H  -3.53165 -2.057244 -1.278334
H  -2.057903 -1.589537 -0.448449
H  -2.529987 -0.762979 -1.927543
H  -2.192707 -1.592379 1.827056
H  -2.009172 -3.170639 3.44972
H  -3.504901 -4.090818 3.636097
H  -3.053684 -2.913873 4.849908
H  -5.739194 -2.843691 3.513752
H  -5.819908 -1.205441 2.878176
H  -5.253107 -1.49839 4.521321
H  0.639635 2.251845 1.315123
H  0.119314 3.722732 0.497697
H  2.472533 1.447973 0.108642
H  -1.000577 2.723812 -2.053987
H  0.007454 1.907964 -4.144124
H  2.241292 0.84558 -4.130267
H  6.164871 0.45182 -1.249377
H  2.275442 -1.293925 -0.756798
H  7.079852 -1.139398 0.40207
H  3.190558 -2.856548 0.895311
H  5.594664 -2.797594 1.490874
elementType: O C H
totalener: -1117.86698214 hartree
nucrepener: 2232.34699339 hartree
electener: -3350.21397552 hartree
oneelecener: -5954.76504537 hartree
twoeener: 2604.55106985 hartree
cpcmener: -0.02493199 hartree
kineticenergy: 1112.79972177 hartree
xcener: -110.228051598443 hartree
chargesum: -0.0000000
charge: -0.293177 -0.465478 -0.330146 0.106703 0.031377 -0.083306 -0.262023 -0.282425 -0.297329 0.381936 -0.045239 -0.221264 -0.257472 0.099962 0.047311 -0.217359 -0.262855 0.279464 -0.106934 -0.252163 0.291173 -0.255851 -0.190229 -0.119237 -0.148101 -0.189741 0.113462 0.094980 0.086757 0.094152 0.093570 0.099742 0.096903 0.096858 0.121972 0.088138 0.093296 0.091298 0.093120 0.088381 0.098603 0.113844 0.120733 0.141028 0.140058 0.156630 0.145446 0.145026 0.154171 0.157123 0.159686 0.157426
qa: -0.2932 -0.4655 -0.3301 0.1067 0.0314 -0.0833 -0.2620 -0.2824 -0.2973 0.3819 -0.0452 -0.2213 -0.2575 0.1000 0.0473 -0.2174 -0.2629 0.2795 -0.1069 -0.2522 0.2912 -0.2559 -0.1902 -0.1192 -0.1481 -0.1897 0.1135 0.0950 0.0868 0.0942 0.0936 0.0997 0.0969 0.0969 0.1220 0.0881 0.0933 0.0913 0.0931 0.0884 0.0986 0.1138 0.1207 0.1410 0.1401 0.1566 0.1454 0.1450 0.1542 0.1571 0.1597 0.1574
va: 2.1133 2.0245 2.0759 3.7113 3.7509 3.8535 3.9085 3.9121 3.8597 4.1164 3.7691 3.9245 3.9406 3.8049 3.6066 3.9482 3.9581 3.7196 3.8838 4.0215 3.6938 4.0076 3.8982 3.8851 3.8971 3.9083 1.0047 1.0304 1.0054 1.0018 1.0026 1.0018 1.0120 1.0015 1.0264 1.0092 0.9964 0.9957 0.9976 1.0123 0.9960 1.0110 0.9917 1.0073 1.0132 0.9892 1.0067 1.0088 1.0012 0.9892 0.9903 0.9907
dispcorr: -0.023995863 hartree
energy: -1117.890977998391
dipole: -28.94442 27.75435 -1.19006 -12.96191 13.36571 0.40380 11.23605 -10.98178 0.25428
magnitude: 1.28217 au
magnitude: 3.25902 debye
