program: Orca
programVersion: 5.0.2
elementType: O O O C C C C C C C C C C C C C C C C C C C C C C C H H H H H H H H H H H H H H H H H H H H H H H H H H
charge: 0
multiplicity: 1
keywords: wb97x-d3
keywords: def2-TZVPP
keywords: def2/J RIJCOSX
keywords: DEFGRID2
keywords: scfconv7
keywords: smallprint printgap noloewdin
keywords: NOSOSCF
formula: C23H26O3
InChI: InChI=1/C23H26O3/c1-16(2)13-20-21(23(20,3)4)22(24)25-15-17-9-8-12-19(14-17)26-18-10-6-5-7-11-18/h5-14,20-21H,15H2,1-4H3
52 atoms
O  -1.230712 1.224045 -1.146774
O  -1.394851 1.089348 1.076537
O  3.842349 0.753621 -1.144152
C  -1.682651 -1.977401 0.626875
C  -3.071768 -1.451289 0.490239
C  -1.926421 -0.804123 -0.302304
C  -1.371711 -3.275563 -0.081604
C  -0.907988 -1.821819 1.911107
C  -3.786463 -0.7506 1.579478
C  -1.495741 0.570092 -0.008653
C  -5.03894 -0.289667 1.496748
C  -5.715546 0.329838 2.681434
C  -5.877515 -0.350654 0.255919
C  -0.728788 2.552286 -1.046498
C  0.715991 2.591322 -0.631229
C  1.597944 1.604215 -1.055337
C  1.190231 3.657793 0.125312
C  2.939761 1.68628 -0.709263
C  2.537598 3.739741 0.443595
C  3.421404 2.751407 0.036743
C  3.557071 -0.576982 -1.006706
C  3.979589 -1.423237 -2.022864
C  2.923191 -1.086812 0.120768
C  3.769528 -2.78979 -1.906899
C  2.7168 -2.45545 0.220106
C  3.134362 -3.312865 -0.789085
H  -3.713448 -2.03843 -0.158679
H  -1.915452 -1.045386 -1.358756
H  -1.947412 -3.386768 -1.001437
H  -1.604254 -4.128429 0.55956
H  -0.312841 -3.334097 -0.342857
H  0.16465 -1.826574 1.708663
H  -1.119472 -2.669017 2.566754
H  -1.128583 -0.914879 2.465977
H  -3.271445 -0.643859 2.528065
H  -6.012524 1.360879 2.471178
H  -5.077283 0.33635 3.565048
H  -6.633615 -0.208259 2.934186
H  -6.69696 -1.066155 0.373146
H  -5.318148 -0.628063 -0.635956
H  -6.343526 0.618857 0.062175
H  -1.342653 3.157916 -0.376626
H  -0.839535 2.964524 -2.050621
H  1.247315 0.77482 -1.65848
H  0.506171 4.425941 0.464791
H  2.903062 4.572328 1.030681
H  4.471536 2.803885 0.294814
H  4.472092 -1.013308 -2.89586
H  2.600111 -0.432195 0.920821
H  4.100186 -3.446287 -2.701476
H  2.231698 -2.852594 1.102526
H  2.969972 -4.378787 -0.701945
elementType: O C H
totalener: -1117.86694388 hartree
nucrepener: 2298.02503140 hartree
electener: -3415.89197528 hartree
oneelecener: -6085.96339333 hartree
twoeener: 2670.07141806 hartree
cpcmener: -0.02621036 hartree
kineticenergy: 1112.80584342 hartree
xcener: -110.228824451376 hartree
chargesum: -0.0000000
charge: -0.299380 -0.465514 -0.333548 0.134661 -0.039179 -0.045123 -0.253594 -0.291319 -0.275679 0.370548 -0.013871 -0.228938 -0.270486 0.104405 0.032946 -0.203987 -0.223672 0.236321 -0.116479 -0.241088 0.268639 -0.241502 -0.162257 -0.122204 -0.188703 -0.178342 0.110947 0.092072 0.088001 0.095151 0.087875 0.081758 0.103833 0.097677 0.120397 0.093898 0.088358 0.092996 0.101724 0.089623 0.094773 0.111925 0.120160 0.142368 0.141359 0.157462 0.146688 0.145212 0.155156 0.157216 0.172626 0.158093
qa: -0.2994 -0.4655 -0.3335 0.1347 -0.0392 -0.0451 -0.2536 -0.2913 -0.2757 0.3705 -0.0139 -0.2289 -0.2705 0.1044 0.0329 -0.2040 -0.2237 0.2363 -0.1165 -0.2411 0.2686 -0.2415 -0.1623 -0.1222 -0.1887 -0.1783 0.1109 0.0921 0.0880 0.0952 0.0879 0.0818 0.1038 0.0977 0.1204 0.0939 0.0884 0.0930 0.1017 0.0896 0.0948 0.1119 0.1202 0.1424 0.1414 0.1575 0.1467 0.1452 0.1552 0.1572 0.1726 0.1581
va: 2.1110 2.0261 2.0675 3.7605 3.8110 3.8308 3.8972 3.8919 3.8846 4.1049 3.7231 3.9300 3.9493 3.8059 3.6253 3.9253 3.9743 3.7529 3.8906 4.0168 3.7185 4.0011 3.8540 3.8943 3.8733 3.8871 1.0020 1.0304 1.0058 1.0022 1.0050 1.0112 0.9997 1.0243 1.0080 0.9969 1.0085 0.9947 0.9958 1.0059 0.9983 1.0134 0.9913 1.0184 1.0031 0.9889 1.0054 1.0081 0.9998 0.9887 0.9794 0.9911
dispcorr: -0.026146250 hartree
energy: -1117.893090125413
dipole: -26.03914 25.24855 -0.79060 -12.24186 11.68304 -0.55882 8.93326 -9.55873 -0.62547
magnitude: 1.15262 au
magnitude: 2.92973 debye
