program: Orca
programVersion: 5.0.2
elementType: O O O C C C C C C C C C C C C C C C C C C C C C C C H H H H H H H H H H H H H H H H H H H H H H H H H H
charge: 0
multiplicity: 1
keywords: wb97x-d3
keywords: def2-TZVPP
keywords: def2/J RIJCOSX
keywords: DEFGRID2
keywords: scfconv7
keywords: smallprint printgap noloewdin
keywords: NOSOSCF
formula: C23H26O3
InChI: InChI=1/C23H26O3/c1-16(2)13-20-21(23(20,3)4)22(24)25-15-17-9-8-12-19(14-17)26-18-10-6-5-7-11-18/h5-14,20-21H,15H2,1-4H3
52 atoms
O  -2.024413 1.390886 -1.677948
O  -1.017914 -0.56596 -1.294316
O  3.409489 0.980772 0.00851
C  -3.723824 -1.584491 -0.22603
C  -3.183078 -0.789934 0.9126
C  -3.242321 -0.173616 -0.493136
C  -5.225274 -1.750354 -0.287644
C  -2.98851 -2.792117 -0.755137
C  -1.899548 -1.101988 1.589582
C  -1.984184 0.150148 -1.182925
C  -1.215796 -0.23694 2.344755
C  0.025819 -0.641605 3.078788
C  -1.614768 1.194462 2.524812
C  -0.834717 1.908114 -2.28927
C  0.204339 2.236529 -1.254946
C  1.352129 1.463425 -1.149003
C  -0.001137 3.290901 -0.368822
C  2.264564 1.713894 -0.132764
C  0.932799 3.554293 0.62125
C  2.062169 2.758771 0.756853
C  3.392635 -0.379492 -0.127586
C  4.575152 -0.971238 -0.553994
C  2.287012 -1.161842 0.187104
C  4.649281 -2.351656 -0.665177
C  2.373773 -2.54101 0.05965
C  3.549368 -3.144015 -0.365089
H  -3.935514 -0.356682 1.566042
H  -4.020192 0.56904 -0.62834
H  -5.54174 -2.604895 0.314077
H  -5.559212 -1.924411 -1.312656
H  -5.750281 -0.870422 0.087053
H  -3.187331 -2.926546 -1.820084
H  -3.349878 -3.685856 -0.242009
H  -1.911242 -2.754789 -0.624848
H  -1.522544 -2.116382 1.498768
H  0.870889 -0.002561 2.809906
H  0.306656 -1.676329 2.88218
H  -0.109339 -0.530712 4.158508
H  -0.819979 1.856065 2.170176
H  -1.759145 1.429222 3.582947
H  -2.526891 1.462792 1.994541
H  -1.165617 2.806846 -2.808494
H  -0.448983 1.212152 -3.036321
H  1.518861 0.654367 -1.849131
H  -0.889671 3.905102 -0.451174
H  0.775551 4.376161 1.307689
H  2.782775 2.949526 1.542281
H  5.431189 -0.35243 -0.793055
H  1.361422 -0.715488 0.525474
H  5.573475 -2.807313 -0.996805
H  1.508188 -3.144886 0.301204
H  3.608095 -4.220199 -0.460416
elementType: O C H
totalener: -1117.86519802 hartree
nucrepener: 2382.42685705 hartree
electener: -3500.29205508 hartree
oneelecener: -6255.17837603 hartree
twoeener: 2754.88632096 hartree
cpcmener: -0.02407915 hartree
kineticenergy: 1112.81030349 hartree
xcener: -110.230262167409 hartree
chargesum: 0.0000000
charge: -0.288238 -0.467569 -0.329593 0.141129 -0.020831 -0.113509 -0.263640 -0.297657 -0.263940 0.395988 -0.008721 -0.248925 -0.263088 0.082850 0.030382 -0.187119 -0.271324 0.291166 -0.096951 -0.258029 0.307613 -0.242865 -0.173188 -0.130311 -0.165145 -0.177572 0.109481 0.091552 0.094135 0.095486 0.086051 0.101289 0.097526 0.090860 0.122466 0.090875 0.092358 0.109785 0.082394 0.110210 0.092405 0.126984 0.113500 0.137566 0.140200 0.158189 0.145388 0.143831 0.118863 0.156137 0.154830 0.156725
qa: -0.2882 -0.4676 -0.3296 0.1411 -0.0208 -0.1135 -0.2636 -0.2977 -0.2639 0.3960 -0.0087 -0.2489 -0.2631 0.0828 0.0304 -0.1871 -0.2713 0.2912 -0.0970 -0.2580 0.3076 -0.2429 -0.1732 -0.1303 -0.1651 -0.1776 0.1095 0.0916 0.0941 0.0955 0.0861 0.1013 0.0975 0.0909 0.1225 0.0909 0.0924 0.1098 0.0824 0.1102 0.0924 0.1270 0.1135 0.1376 0.1402 0.1582 0.1454 0.1438 0.1189 0.1561 0.1548 0.1567
va: 2.1135 2.0191 2.0881 3.7527 3.8008 3.8388 3.8974 3.9015 3.8438 4.1209 3.6761 3.9277 3.9393 3.8218 3.5490 3.9105 3.9333 3.7053 3.8142 3.9937 3.6982 3.9830 3.8757 3.8968 3.9216 3.9079 1.0045 1.0311 1.0023 1.0025 1.0044 1.0004 0.9990 1.0149 1.0018 0.9909 1.0058 1.0001 1.0052 1.0025 1.0081 0.9921 1.0089 1.0170 1.0081 0.9885 1.0064 1.0094 1.0010 0.9894 0.9946 0.9907
dispcorr: -0.030118622 hartree
energy: -1117.895316645177
dipole: -18.15676 17.01788 -1.13888 -9.07500 9.57452 0.49952 9.83372 -9.58295 0.25076
magnitude: 1.26864 au
magnitude: 3.22462 debye
