program: Orca
programVersion: 5.0.2
elementType: O O O C C C C C C C C C C C C C C C C C C C C C C C H H H H H H H H H H H H H H H H H H H H H H H H H H
charge: 0
multiplicity: 1
keywords: wb97x-d3
keywords: def2-TZVPP
keywords: def2/J RIJCOSX
keywords: DEFGRID2
keywords: scfconv7
keywords: smallprint printgap noloewdin
keywords: NOSOSCF
formula: C23H26O3
InChI: InChI=1/C23H26O3/c1-16(2)13-20-21(23(20,3)4)22(24)25-15-17-9-8-12-19(14-17)26-18-10-6-5-7-11-18/h5-14,20-21H,15H2,1-4H3
52 atoms
O  -1.575386 1.875682 0.19563
O  -0.647212 -0.009179 0.960797
O  3.673316 0.857103 -1.366085
C  -2.829539 -1.500381 -0.649331
C  -3.477162 -1.176515 0.649552
C  -2.772175 -0.069586 -0.145782
C  -3.73848 -1.70813 -1.838359
C  -1.596287 -2.368311 -0.705807
C  -2.967923 -1.654208 1.956393
C  -1.55268 0.553788 0.392609
C  -3.258838 -1.056944 3.114888
C  -2.782094 -1.60053 4.424675
C  -4.079488 0.20168 3.169181
C  -0.450029 2.653985 0.62959
C  0.622295 2.661396 -0.421613
C  1.672779 1.752987 -0.362207
C  0.543959 3.55567 -1.485685
C  2.613785 1.71939 -1.382847
C  1.506862 3.534272 -2.482856
C  2.538875 2.608602 -2.445148
C  3.515745 -0.429614 -0.929411
C  2.372859 -1.176344 -1.193745
C  4.58682 -0.99391 -0.249727
C  2.30962 -2.492369 -0.758808
C  4.512268 -2.314117 0.169682
C  3.373052 -3.067802 -0.076501
H  -4.557976 -1.060522 0.610334
H  -3.433761 0.6252 -0.649991
H  -3.219956 -1.484707 -2.773099
H  -4.62664 -1.076231 -1.791742
H  -4.074755 -2.746126 -1.886174
H  -0.997961 -2.122133 -1.585354
H  -1.894102 -3.41497 -0.798223
H  -0.953507 -2.287223 0.165292
H  -2.361786 -2.554885 1.965499
H  -2.162911 -0.868312 4.950058
H  -2.196622 -2.512235 4.304438
H  -3.622651 -1.823857 5.087483
H  -4.127355 0.607874 4.179669
H  -5.108545 0.029315 2.842875
H  -3.672273 0.981895 2.521772
H  -0.073547 2.294994 1.588042
H  -0.84848 3.656582 0.77926
H  1.74988 1.073324 0.476774
H  -0.266919 4.272653 -1.530162
H  1.451161 4.236357 -3.304672
H  3.285259 2.578605 -3.229263
H  1.539154 -0.746957 -1.735047
H  5.47301 -0.402313 -0.055656
H  1.419193 -3.073078 -0.963521
H  5.350391 -2.750777 0.697617
H  3.314018 -4.094854 0.258778
elementType: O C H
totalener: -1117.86453494 hartree
nucrepener: 2306.07435330 hartree
electener: -3423.93888824 hartree
oneelecener: -6102.41194827 hartree
twoeener: 2678.47306003 hartree
cpcmener: -0.02512835 hartree
kineticenergy: 1112.80946610 hartree
xcener: -110.226876599082 hartree
chargesum: 0.0000000
charge: -0.295554 -0.469260 -0.330747 0.151884 -0.043172 -0.087874 -0.262957 -0.326109 -0.254883 0.395317 -0.013768 -0.223184 -0.275463 0.078712 -0.009533 -0.174463 -0.231386 0.267691 -0.115331 -0.248899 0.313275 -0.218210 -0.261428 -0.132136 -0.112417 -0.204557 0.112983 0.092047 0.095750 0.086155 0.093964 0.101537 0.104002 0.093301 0.121407 0.096583 0.085067 0.098038 0.096918 0.101546 0.095505 0.113752 0.123058 0.145512 0.142628 0.157854 0.145541 0.155469 0.144347 0.168421 0.156688 0.156378
qa: -0.2956 -0.4693 -0.3307 0.1519 -0.0432 -0.0879 -0.2630 -0.3261 -0.2549 0.3953 -0.0138 -0.2232 -0.2755 0.0787 -0.0095 -0.1745 -0.2314 0.2677 -0.1153 -0.2489 0.3133 -0.2182 -0.2614 -0.1321 -0.1124 -0.2046 0.1130 0.0920 0.0958 0.0862 0.0940 0.1015 0.1040 0.0933 0.1214 0.0966 0.0851 0.0980 0.0969 0.1015 0.0955 0.1138 0.1231 0.1455 0.1426 0.1579 0.1455 0.1555 0.1443 0.1684 0.1567 0.1564
va: 2.1068 2.0119 2.0827 3.7514 3.8332 3.8122 3.8966 3.8964 3.8062 4.0894 3.6944 3.9217 3.9492 3.8138 3.6451 3.8796 3.9858 3.7463 3.8889 4.0240 3.6912 3.9035 4.0126 3.8635 3.8841 3.9460 1.0029 1.0312 1.0025 1.0053 1.0023 0.9953 1.0002 1.0116 1.0010 0.9939 1.0088 0.9930 1.0057 0.9975 1.0024 1.0135 0.9949 1.0227 1.0034 0.9886 1.0066 0.9967 1.0090 0.9829 0.9887 0.9927
dispcorr: -0.026449445 hartree
energy: -1117.890984380995
dipole: -23.51868 22.25819 -1.26049 -12.00532 12.32501 0.31969 9.53848 -9.67249 -0.13402
magnitude: 1.30729 au
magnitude: 3.32286 debye
