program: Orca
programVersion: 5.0.2
elementType: O O O C C C C C C C C C C C C C C C C C C C C C C C H H H H H H H H H H H H H H H H H H H H H H H H H H
charge: 0
multiplicity: 1
keywords: wb97x-d3
keywords: def2-TZVPP
keywords: def2/J RIJCOSX
keywords: DEFGRID2
keywords: scfconv7
keywords: smallprint printgap noloewdin
keywords: NOSOSCF
formula: C23H26O3
InChI: InChI=1/C23H26O3/c1-16(2)13-20-21(23(20,3)4)22(24)25-15-17-9-8-12-19(14-17)26-18-10-6-5-7-11-18/h5-14,20-21H,15H2,1-4H3
52 atoms
O  -1.781574 2.157261 0.407162
O  -0.803312 0.164482 0.638291
O  3.502016 0.825084 -1.559033
C  -3.542243 -0.804621 -0.600266
C  -3.585816 -1.064155 0.866094
C  -3.182464 0.317087 0.364727
C  -4.855748 -0.628832 -1.324619
C  -2.476262 -1.445268 -1.454535
C  -2.647802 -2.007647 1.527555
C  -1.804443 0.821905 0.489003
C  -2.159135 -1.882358 2.762688
C  -1.229459 -2.907364 3.338293
C  -2.444316 -0.708362 3.647389
C  -0.503616 2.800081 0.477887
C  0.349634 2.497941 -0.722115
C  1.553538 1.827192 -0.562493
C  -0.073339 2.860901 -1.997997
C  2.311638 1.489112 -1.675262
C  0.705965 2.544519 -3.100305
C  1.896049 1.84637 -2.948632
C  3.608963 -0.251363 -0.722188
C  4.858252 -0.478459 -0.158366
C  2.55178 -1.119172 -0.468549
C  5.049111 -1.580798 0.661715
C  2.755468 -2.209681 0.365079
C  3.999347 -2.448031 0.93378
H  -4.584088 -1.052823 1.298351
H  -3.937502 1.088652 0.464875
H  -5.610703 -0.159213 -0.692467
H  -5.248956 -1.595917 -1.645679
H  -4.734854 -0.008822 -2.215337
H  -2.83644 -2.404144 -1.832936
H  -1.542771 -1.633368 -0.929934
H  -2.249627 -0.818722 -2.319932
H  -2.368281 -2.886929 0.9531
H  -0.261233 -2.460433 3.581897
H  -1.051634 -3.733951 2.64999
H  -1.621579 -3.322658 4.270657
H  -1.529664 -0.137733 3.834001
H  -2.80567 -1.035573 4.625942
H  -3.183638 -0.025066 3.232044
H  0.009593 2.527904 1.402583
H  -0.739772 3.862582 0.529431
H  1.882397 1.546784 0.43102
H  -1.008118 3.391659 -2.132764
H  0.380182 2.829934 -4.09222
H  2.496429 1.580121 -3.809596
H  5.674606 0.202818 -0.365717
H  1.576352 -0.957334 -0.909557
H  6.025686 -1.754947 1.095519
H  1.928686 -2.879839 0.564793
H  4.148966 -3.301913 1.581472
elementType: O C H
totalener: -1117.86470680 hartree
nucrepener: 2321.91472137 hartree
electener: -3439.77942816 hartree
oneelecener: -6134.29509390 hartree
twoeener: 2694.51566573 hartree
cpcmener: -0.02474606 hartree
kineticenergy: 1112.80058639 hartree
xcener: -110.226235040694 hartree
chargesum: -0.0000000
charge: -0.293049 -0.462265 -0.332047 0.133204 -0.017353 -0.121747 -0.266267 -0.293164 -0.258451 0.400788 -0.025420 -0.229082 -0.268589 0.087258 0.036815 -0.201333 -0.255700 0.272598 -0.108613 -0.247491 0.299940 -0.252900 -0.196349 -0.120024 -0.149315 -0.191349 0.113155 0.093723 0.086451 0.093535 0.094640 0.101505 0.089293 0.099795 0.120507 0.093290 0.088433 0.096604 0.097652 0.104965 0.094378 0.114118 0.125633 0.138770 0.141190 0.156788 0.146538 0.144267 0.153304 0.157069 0.158153 0.156148
qa: -0.2930 -0.4623 -0.3320 0.1332 -0.0174 -0.1217 -0.2663 -0.2932 -0.2585 0.4008 -0.0254 -0.2291 -0.2686 0.0873 0.0368 -0.2013 -0.2557 0.2726 -0.1086 -0.2475 0.2999 -0.2529 -0.1963 -0.1200 -0.1493 -0.1913 0.1132 0.0937 0.0865 0.0935 0.0946 0.1015 0.0893 0.0998 0.1205 0.0933 0.0884 0.0966 0.0977 0.1050 0.0944 0.1141 0.1256 0.1388 0.1412 0.1568 0.1465 0.1443 0.1533 0.1571 0.1582 0.1561
va: 2.1134 2.0249 2.0792 3.7322 3.8403 3.8235 3.9020 3.9152 3.8551 4.0960 3.7043 3.9250 3.9463 3.8193 3.5667 3.9208 3.9654 3.7260 3.8775 4.0251 3.6985 4.0005 3.8844 3.8854 3.8954 3.9118 1.0041 1.0310 1.0049 1.0020 1.0020 0.9994 1.0080 1.0017 0.9992 0.9961 1.0071 0.9981 0.9990 1.0005 1.0038 1.0068 0.9910 1.0115 1.0089 0.9889 1.0059 1.0090 0.9985 0.9889 0.9903 0.9911
dispcorr: -0.026634314 hartree
energy: -1117.891341111993
dipole: -20.35224 19.16858 -1.18366 -12.74743 13.09180 0.34437 9.12284 -8.89480 0.22805
magnitude: 1.25366 au
magnitude: 3.18654 debye
