program: Orca
programVersion: 5.0.2
elementType: O O O C C C C C C C C C C C C C C C C C C C C C C C H H H H H H H H H H H H H H H H H H H H H H H H H H
charge: 0
multiplicity: 1
keywords: wb97x-d3
keywords: def2-TZVPP
keywords: def2/J RIJCOSX
keywords: DEFGRID2
keywords: scfconv7
keywords: smallprint printgap noloewdin
keywords: NOSOSCF
formula: C23H26O3
InChI: InChI=1/C23H26O3/c1-16(2)13-20-21(23(20,3)4)22(24)25-15-17-9-8-12-19(14-17)26-18-10-6-5-7-11-18/h5-14,20-21H,15H2,1-4H3
52 atoms
O  -1.506507 2.395761 0.390536
O  -0.591902 0.429767 0.916437
O  3.598722 0.756503 -1.835399
C  -3.313053 -0.59229 -0.321456
C  -3.482644 -0.675938 1.164947
C  -2.961241 0.612493 0.537022
C  -4.563002 -0.440349 -1.154493
C  -2.236119 -1.385816 -1.018226
C  -2.666604 -1.556442 2.022828
C  -1.570522 1.086756 0.651326
C  -3.121958 -2.304932 3.034524
C  -2.180122 -3.165169 3.823651
C  -4.546634 -2.372837 3.496002
C  -0.207216 2.992832 0.315372
C  0.533354 2.535587 -0.909717
C  1.740734 1.864266 -0.785267
C  -0.002756 2.761841 -2.175706
C  2.397877 1.406744 -1.920489
C  0.66995 2.315377 -3.301762
C  1.869502 1.626343 -3.182193
C  3.754671 -0.25995 -0.933536
C  5.023213 -0.428584 -0.394242
C  2.721283 -1.126255 -0.594145
C  5.257815 -1.472284 0.488748
C  2.969857 -2.159605 0.298068
C  4.233431 -2.338901 0.844553
H  -4.509061 -0.556825 1.493487
H  -3.684151 1.419113 0.494916
H  -4.347188 0.071752 -2.094716
H  -5.333266 0.130617 -0.634374
H  -4.983511 -1.418287 -1.398654
H  -2.630482 -2.365035 -1.297045
H  -1.346687 -1.556649 -0.418041
H  -1.924093 -0.884876 -1.937151
H  -1.607022 -1.611779 1.8086
H  -1.146366 -3.054914 3.495594
H  -2.448573 -4.222047 3.740729
H  -2.222537 -2.920448 4.888724
H  -5.2561 -1.896024 2.822267
H  -4.657048 -1.90443 4.478225
H  -4.859752 -3.41299 3.616458
H  0.365796 2.793691 1.222888
H  -0.40353 4.063958 0.274369
H  2.159062 1.687554 0.198749
H  -0.943303 3.288261 -2.283577
H  0.254411 2.492502 -4.285318
H  2.390296 1.263475 -4.059413
H  5.81957 0.252412 -0.667821
H  1.731435 -1.00708 -1.016493
H  6.247921 -1.599452 0.907466
H  2.163793 -2.832355 0.561727
H  4.418193 -3.147614 1.539213
elementType: O C H
totalener: -1117.86667727 hartree
nucrepener: 2273.41508355 hartree
electener: -3391.28176082 hartree
oneelecener: -6037.01610044 hartree
twoeener: 2645.73433963 hartree
cpcmener: -0.02478749 hartree
kineticenergy: 1112.80614752 hartree
xcener: -110.227924604159 hartree
chargesum: -0.0000000
charge: -0.288776 -0.468158 -0.333095 0.105025 0.029700 -0.091536 -0.262680 -0.277254 -0.296325 0.392782 -0.045864 -0.220573 -0.261912 0.088214 0.019593 -0.182344 -0.244159 0.254574 -0.118566 -0.235595 0.282019 -0.243868 -0.182978 -0.125991 -0.155363 -0.184924 0.114608 0.095712 0.093529 0.086731 0.094620 0.101166 0.086837 0.099607 0.122497 0.087754 0.092755 0.091135 0.089872 0.100631 0.092477 0.113596 0.125815 0.141751 0.141486 0.157778 0.146976 0.144873 0.153714 0.157165 0.158104 0.156866
qa: -0.2888 -0.4682 -0.3331 0.1050 0.0297 -0.0915 -0.2627 -0.2773 -0.2963 0.3928 -0.0459 -0.2206 -0.2619 0.0882 0.0196 -0.1823 -0.2442 0.2546 -0.1186 -0.2356 0.2820 -0.2439 -0.1830 -0.1260 -0.1554 -0.1849 0.1146 0.0957 0.0935 0.0867 0.0946 0.1012 0.0868 0.0996 0.1225 0.0878 0.0928 0.0911 0.0899 0.1006 0.0925 0.1136 0.1258 0.1418 0.1415 0.1578 0.1470 0.1449 0.1537 0.1572 0.1581 0.1569
va: 2.1161 2.0226 2.0734 3.7139 3.7409 3.8423 3.9087 3.9166 3.8569 4.1303 3.7642 3.9250 3.9399 3.8122 3.5958 3.9162 3.9573 3.7378 3.8832 4.0174 3.7065 3.9971 3.8781 3.8913 3.9042 3.9053 1.0038 1.0296 1.0023 1.0056 1.0017 1.0022 1.0098 1.0003 1.0232 1.0094 0.9964 0.9956 1.0119 0.9952 0.9979 1.0098 0.9921 1.0112 1.0092 0.9888 1.0051 1.0085 0.9978 0.9890 0.9909 0.9907
dispcorr: -0.024946417 hartree
energy: -1117.891623691032
dipole: -25.13735 23.79158 -1.34577 -16.05716 16.27562 0.21846 10.53161 -10.53164 -0.00003
magnitude: 1.36339 au
magnitude: 3.46545 debye
