program: Orca
programVersion: 5.0.2
elementType: O O O C C C C C C C C C C C C C C C C C C C C C C C H H H H H H H H H H H H H H H H H H H H H H H H H H
charge: 0
multiplicity: 1
keywords: wb97x-d3
keywords: def2-TZVPP
keywords: def2/J RIJCOSX
keywords: DEFGRID2
keywords: scfconv7
keywords: smallprint printgap noloewdin
keywords: NOSOSCF
formula: C23H26O3
InChI: InChI=1/C23H26O3/c1-16(2)13-20-21(23(20,3)4)22(24)25-15-17-9-8-12-19(14-17)26-18-10-6-5-7-11-18/h5-14,20-21H,15H2,1-4H3
52 atoms
O  -1.601726 0.827072 -0.945489
O  -3.563184 1.184961 -1.939367
O  3.530501 0.603429 -0.291396
C  -2.710203 -1.97259 -0.334286
C  -2.797346 -1.132115 0.893182
C  -3.38647 -0.612689 -0.419641
C  -3.649137 -3.151555 -0.438657
C  -1.380571 -2.227457 -1.000578
C  -1.603176 -0.553358 1.555267
C  -2.872513 0.542545 -1.178801
C  -1.634199 0.497086 2.377486
C  -0.39867 0.992165 3.062778
C  -2.901257 1.254215 2.65685
C  -1.00643 1.953213 -1.599972
C  0.286442 2.211154 -0.885677
C  1.308064 1.267773 -0.949319
C  0.458886 3.366194 -0.133772
C  2.482141 1.477517 -0.241348
C  1.648606 3.577446 0.550582
C  2.659907 2.632061 0.511042
C  3.302901 -0.745762 -0.313736
C  2.355918 -1.347475 0.506573
C  4.10387 -1.510551 -1.14958
C  2.210749 -2.726755 0.474797
C  3.955767 -2.890447 -1.162067
C  3.005749 -3.504044 -0.357543
H  -3.586116 -1.417972 1.585617
H  -4.467686 -0.659206 -0.483274
H  -4.606855 -2.953512 0.044561
H  -3.213365 -4.031635 0.039375
H  -3.848972 -3.405723 -1.481677
H  -1.511963 -2.373542 -2.074668
H  -0.942338 -3.14423 -0.600266
H  -0.650258 -1.434795 -0.862319
H  -0.652786 -1.051079 1.384797
H  0.476423 0.385831 2.826235
H  -0.521556 0.995369 4.149519
H  -0.179301 2.024115 2.774386
H  -3.514009 1.375452 1.761475
H  -2.692448 2.249214 3.052124
H  -3.51992 0.74292 3.400073
H  -1.65991 2.824929 -1.541255
H  -0.845407 1.719932 -2.655521
H  1.182365 0.376111 -1.553069
H  -0.33562 4.10012 -0.080693
H  1.784527 4.47961 1.132532
H  3.584131 2.786153 1.05368
H  1.740303 -0.753203 1.170795
H  4.840216 -1.028342 -1.780466
H  1.474018 -3.195143 1.114839
H  4.583447 -3.48552 -1.812916
H  2.888849 -4.579616 -0.374159
elementType: O C H
totalener: -1117.86217885 hartree
nucrepener: 2378.85512072 hartree
electener: -3496.71729957 hartree
oneelecener: -6246.68750965 hartree
twoeener: 2749.97021008 hartree
cpcmener: -0.02708964 hartree
kineticenergy: 1112.81184742 hartree
xcener: -110.228485110132 hartree
chargesum: -0.0000000
charge: -0.252102 -0.480680 -0.330784 0.138320 -0.022002 -0.147348 -0.268904 -0.270644 -0.200034 0.414010 -0.038783 -0.259615 -0.275566 0.070936 -0.016508 -0.207186 -0.203185 0.273522 -0.124029 -0.233827 0.253242 -0.149779 -0.218906 -0.209701 -0.141454 -0.147637 0.112466 0.093137 0.086451 0.092688 0.096166 0.108197 0.098383 0.051523 0.110464 0.094189 0.115377 0.089760 0.096653 0.095646 0.108553 0.100452 0.124685 0.148420 0.142486 0.157002 0.145455 0.160733 0.145686 0.159656 0.156819 0.157597
qa: -0.2521 -0.4807 -0.3308 0.1383 -0.0220 -0.1473 -0.2689 -0.2706 -0.2000 0.4140 -0.0388 -0.2596 -0.2756 0.0709 -0.0165 -0.2072 -0.2032 0.2735 -0.1240 -0.2338 0.2532 -0.1498 -0.2189 -0.2097 -0.1415 -0.1476 0.1125 0.0931 0.0865 0.0927 0.0962 0.1082 0.0984 0.0515 0.1105 0.0942 0.1154 0.0898 0.0967 0.0956 0.1086 0.1005 0.1247 0.1484 0.1425 0.1570 0.1455 0.1607 0.1457 0.1597 0.1568 0.1576
va: 2.1068 2.0263 2.0826 3.7409 3.7721 3.8957 3.9063 3.9206 3.7641 4.1182 3.6797 3.9259 3.9449 3.8279 3.7246 3.8896 3.8990 3.7113 3.8805 3.9948 3.7248 3.8217 3.9815 3.8964 3.9076 3.8756 1.0035 1.0298 1.0055 1.0019 1.0017 1.0043 0.9992 1.0048 0.9939 1.0003 0.9975 0.9933 0.9995 1.0040 0.9966 1.0113 0.9946 1.0039 1.0018 0.9895 1.0065 0.9801 1.0076 0.9921 0.9892 0.9898
dispcorr: -0.030636617 hartree
energy: -1117.892815468881
dipole: -13.40010 13.86530 0.46520 -8.90352 8.22763 -0.67590 10.31020 -9.41929 0.89091
magnitude: 1.21118 au
magnitude: 3.07858 debye
