program: Orca
programVersion: 5.0.2
elementType: O O O C C C C C C C C C C C C C C C C C C C C C C C H H H H H H H H H H H H H H H H H H H H H H H H H H
charge: 0
multiplicity: 1
keywords: wb97x-d3
keywords: def2-TZVPP
keywords: def2/J RIJCOSX
keywords: DEFGRID2
keywords: scfconv7
keywords: smallprint printgap noloewdin
keywords: NOSOSCF
formula: C23H26O3
InChI: InChI=1/C23H26O3/c1-16(2)13-20-21(23(20,3)4)22(24)25-15-17-9-8-12-19(14-17)26-18-10-6-5-7-11-18/h5-14,20-21H,15H2,1-4H3
52 atoms
O  -1.862598 1.235656 -0.689535
O  -3.954351 1.836577 -1.156887
O  2.943406 0.89989 0.657719
C  -2.771571 -1.633609 -0.560963
C  -3.012806 -1.101365 0.815145
C  -3.582114 -0.359306 -0.386691
C  -3.592827 -2.831673 -0.980689
C  -1.394349 -1.629425 -1.179818
C  -1.977356 -0.495105 1.69255
C  -3.164901 0.998746 -0.781735
C  -0.946778 -1.143646 2.240649
C  -0.002364 -0.445348 3.170735
C  -0.639588 -2.587486 1.993043
C  -1.396547 2.545014 -0.999673
C  0.104476 2.55245 -0.953105
C  0.826388 1.675014 -0.153167
C  0.78556 3.505418 -1.707511
C  2.213762 1.742854 -0.141151
C  2.168051 3.578615 -1.664187
C  2.896204 2.687165 -0.888609
C  2.900564 -0.446806 0.44387
C  2.443884 -1.023398 -0.735482
C  3.380323 -1.2461 1.476646
C  2.458575 -2.406848 -0.863864
C  3.393097 -2.623727 1.329674
C  2.926466 -3.2144 0.161791
H  -3.793792 -1.621799 1.366246
H  -4.649883 -0.477554 -0.530211
H  -3.701333 -2.871656 -2.06666
H  -4.593942 -2.815136 -0.547704
H  -3.10943 -3.758109 -0.662389
H  -0.701082 -0.942748 -0.70363
H  -1.441112 -1.382825 -2.242476
H  -0.965077 -2.630005 -1.101955
H  -2.122495 0.546547 1.965279
H  1.025062 -0.506201 2.803302
H  -0.003103 -0.917178 4.157259
H  -0.252481 0.607408 3.302076
H  -1.382981 -3.086288 1.37396
H  -0.576278 -3.1312 2.939644
H  0.335109 -2.701443 1.510595
H  -1.801655 3.261267 -0.278344
H  -1.737686 2.850556 -1.991212
H  0.325319 0.934861 0.459659
H  0.23088 4.192308 -2.335561
H  2.68725 4.322586 -2.254227
H  3.977891 2.724668 -0.863854
H  2.083485 -0.416388 -1.555658
H  3.74034 -0.785899 2.388603
H  2.101466 -2.850785 -1.784384
H  3.765431 -3.238294 2.13932
H  2.932321 -4.290726 0.051907
elementType: O C H
totalener: -1117.86331263 hartree
nucrepener: 2396.50485286 hartree
electener: -3514.36816549 hartree
oneelecener: -6281.84471375 hartree
twoeener: 2767.47654826 hartree
cpcmener: -0.02417772 hartree
kineticenergy: 1112.79871801 hartree
xcener: -110.232262443768 hartree
chargesum: 0.0000000
charge: -0.261900 -0.474100 -0.328147 0.084221 0.000644 -0.094748 -0.273015 -0.245341 -0.273102 0.391554 0.006593 -0.245506 -0.235908 0.065645 0.008727 -0.143640 -0.194126 0.207009 -0.147931 -0.185955 0.308407 -0.201300 -0.260471 -0.176723 -0.120315 -0.167361 0.110515 0.092078 0.098542 0.087134 0.091081 0.045705 0.116784 0.094616 0.113588 0.087948 0.109215 0.095185 0.096488 0.109311 0.059489 0.118642 0.108027 0.107615 0.140907 0.156970 0.146005 0.154794 0.147315 0.158895 0.155346 0.154595
qa: -0.2619 -0.4741 -0.3281 0.0842 0.0006 -0.0947 -0.2730 -0.2453 -0.2731 0.3916 0.0066 -0.2455 -0.2359 0.0656 0.0087 -0.1436 -0.1941 0.2070 -0.1479 -0.1860 0.3084 -0.2013 -0.2605 -0.1767 -0.1203 -0.1674 0.1105 0.0921 0.0985 0.0871 0.0911 0.0457 0.1168 0.0946 0.1136 0.0879 0.1092 0.0952 0.0965 0.1093 0.0595 0.1186 0.1080 0.1076 0.1409 0.1570 0.1460 0.1548 0.1473 0.1589 0.1553 0.1546
va: 2.1179 2.0356 2.0729 3.7200 3.7899 3.8751 3.9160 3.8844 3.8463 4.1436 3.6411 3.9132 3.9367 3.8207 3.7578 3.8802 3.9286 3.7664 3.9082 3.9829 3.6383 3.8181 3.9309 3.8725 3.8547 3.8535 1.0059 1.0275 1.0006 1.0059 1.0032 1.0029 1.0054 0.9988 1.0158 0.9962 0.9997 1.0075 1.0085 1.0040 1.0139 0.9924 1.0050 1.0159 1.0010 0.9898 1.0041 0.9996 1.0084 0.9912 0.9898 0.9915
dispcorr: -0.032196575 hartree
energy: -1117.895509202493
dipole: -6.82044 7.61584 0.79540 -17.57979 16.59541 -0.98438 5.00452 -4.96913 0.03538
magnitude: 1.26606 au
magnitude: 3.21807 debye
