program: Orca
programVersion: 5.0.2
elementType: O O O C C C C C C C C C C C C C C C C C C C C C C C H H H H H H H H H H H H H H H H H H H H H H H H H H
charge: 0
multiplicity: 1
keywords: wb97x-d3
keywords: def2-TZVPP
keywords: def2/J RIJCOSX
keywords: DEFGRID2
keywords: scfconv7
keywords: smallprint printgap noloewdin
keywords: NOSOSCF
formula: C23H26O3
InChI: InChI=1/C23H26O3/c1-16(2)13-20-21(23(20,3)4)22(24)25-15-17-9-8-12-19(14-17)26-18-10-6-5-7-11-18/h5-14,20-21H,15H2,1-4H3
52 atoms
O  -1.636403 0.824797 -0.921824
O  -3.598375 1.199102 -1.907843
O  3.479902 0.600769 -0.179884
C  -2.772625 -1.981007 -0.347411
C  -2.839447 -1.160699 0.895441
C  -3.428942 -0.609321 -0.400929
C  -3.727377 -3.145115 -0.469812
C  -1.448461 -2.238895 -1.023032
C  -1.621177 -0.630021 1.559207
C  -2.909481 0.54973 -1.151548
C  -1.561208 0.474629 2.304494
C  -0.287802 0.899351 2.97005
C  -2.72917 1.387383 2.513416
C  -1.035605 1.95125 -1.570771
C  0.249285 2.212987 -0.843465
C  1.26483 1.261102 -0.877786
C  0.418182 3.377362 -0.105699
C  2.429719 1.472521 -0.155695
C  1.599478 3.590062 0.593154
C  2.604184 2.637564 0.582331
C  3.276329 -0.749721 -0.251439
C  2.278308 -1.390842 0.472538
C  4.161331 -1.478737 -1.033497
C  2.169934 -2.772035 0.401545
C  4.048556 -2.860797 -1.085474
C  3.05018 -3.51343 -0.375517
H  -3.625441 -1.452573 1.588253
H  -4.511208 -0.640819 -0.456546
H  -3.936489 -3.376363 -1.516333
H  -4.679617 -2.943485 0.022703
H  -3.301075 -4.040101 -0.011312
H  -1.017398 -3.165416 -0.637535
H  -0.710707 -1.454835 -0.874447
H  -1.58431 -2.367896 -2.098777
H  -0.718146 -1.225349 1.452643
H  -0.427947 1.033187 4.046312
H  0.05383 1.863348 2.582554
H  0.515743 0.176789 2.827422
H  -3.051158 1.375044 3.558635
H  -3.590824 1.12974 1.899195
H  -2.45473 2.421714 2.289457
H  -1.690594 2.822338 -1.520947
H  -0.862625 1.716783 -2.624243
H  1.141021 0.363087 -1.472183
H  -0.37226 4.11692 -0.07384
H  1.733206 4.499331 1.164515
H  3.522226 2.794171 1.134698
H  1.5942 -0.826361 1.093634
H  4.936369 -0.96695 -1.590421
H  1.394743 -3.270414 0.969481
H  4.742813 -3.426931 -1.693098
H  2.962015 -4.590836 -0.422102
elementType: O C H
totalener: -1117.86249364 hartree
nucrepener: 2385.52285466 hartree
electener: -3503.38534830 hartree
oneelecener: -6259.94407796 hartree
twoeener: 2756.55872966 hartree
cpcmener: -0.02673546 hartree
kineticenergy: 1112.81695983 hartree
xcener: -110.231024740922 hartree
chargesum: 0.0000000
charge: -0.250151 -0.479387 -0.328709 0.143571 -0.007591 -0.161754 -0.269702 -0.275646 -0.227902 0.418684 -0.031076 -0.265026 -0.269692 0.065379 -0.009441 -0.223746 -0.207961 0.296524 -0.116178 -0.244752 0.265357 -0.145547 -0.225622 -0.203053 -0.140001 -0.152365 0.113353 0.094908 0.095796 0.086465 0.092462 0.098536 0.054932 0.107398 0.121417 0.112780 0.088766 0.102932 0.109600 0.093862 0.093118 0.101009 0.125746 0.149283 0.141525 0.156422 0.144426 0.141901 0.144914 0.159431 0.157231 0.157576
qa: -0.2502 -0.4794 -0.3287 0.1436 -0.0076 -0.1618 -0.2697 -0.2756 -0.2279 0.4187 -0.0311 -0.2650 -0.2697 0.0654 -0.0094 -0.2237 -0.2080 0.2965 -0.1162 -0.2448 0.2654 -0.1455 -0.2256 -0.2031 -0.1400 -0.1524 0.1134 0.0949 0.0958 0.0865 0.0925 0.0985 0.0549 0.1074 0.1214 0.1128 0.0888 0.1029 0.1096 0.0939 0.0931 0.1010 0.1257 0.1493 0.1415 0.1564 0.1444 0.1419 0.1449 0.1594 0.1572 0.1576
va: 2.1084 2.0278 2.0894 3.7167 3.7760 3.8884 3.9087 3.9241 3.8086 4.1138 3.6671 3.9331 3.9473 3.8311 3.7169 3.8956 3.8990 3.6881 3.8723 3.9966 3.7300 3.8274 3.9802 3.8960 3.9068 3.8831 1.0053 1.0285 1.0017 1.0054 1.0018 0.9984 1.0042 1.0049 0.9883 1.0006 0.9959 0.9943 0.9991 1.0049 0.9986 1.0119 0.9947 1.0025 1.0026 0.9896 1.0076 0.9907 1.0083 0.9921 0.9890 0.9902
dispcorr: -0.031211058 hartree
energy: -1117.893704702234
dipole: -12.83604 13.34859 0.51255 -8.80329 8.14374 -0.65955 9.49978 -8.66682 0.83296
magnitude: 1.17963 au
magnitude: 2.99839 debye
